program: Gaussian 09
title: 000195998
version: EM64L-G09RevD.01
frameworkgroup: C1[X(C17H18N2O)]
method: RPBEPBE
basis: SDD
operation: Freq
keyword: #p
keyword: freq=noraman
keyword: PBEPBE/SDD
title: #p freq=noraman PBEPBE/SDD
converged: YES YES NO NO
title: Mulliken charges:
elementType: O N N C C C C C C C C C C C C C C C C C H H H H H H H H H H H H H H H H H H
charge: -0.441767 -0.228264 -0.228981 -0.210700 -0.505909 -0.380212 0.364791 0.249546 -0.454798 0.328964 -0.751947 0.430192 -0.418497 -0.326347 -0.417937 -0.572791 -0.257481 -0.427051 -0.242736 0.297551 0.194947 0.224524 0.245741 0.233661 0.173355 0.215826 0.221597 0.249506 0.222703 0.234019 0.235052 0.239922 0.230162 0.255412 0.225846 0.215075 0.226672 0.350353
chargesum: 0.00000
title: Mulliken charges with hydrogens summed into heavy atoms:
elementType: O N N C C C C C C C C C C C C C C C C C
charge: -0.091413 -0.228264 0.020525 -0.015752 -0.035644 0.026804 0.364791 0.249546 -0.017375 0.328964 -0.295225 0.430192 -0.183446 -0.086425 -0.187775 -0.317379 -0.031635 -0.211976 -0.016064 0.297551
polarizability: 2.30796687e+02 4.99323210e-01 2.21850218e+02 8.46354002e+00 1.55630773e+01 1.41716825e+02
1716.lowfreq: -11.1379 -0.0008 -0.0002 0.0001 4.5272 5.1678 52.6048 54.0704 89.4658
frequency: 52.5766 54.0649 89.4628 104.5705 138.2627 164.4930 204.1928 248.2873 258.0950 278.3991 293.0123 323.2882 333.5632 338.4502 354.2658 375.6479 416.3450 441.0734 458.6303 471.0038 493.3727 496.4594 538.3577 559.2684 565.3980 581.5778 633.9761 639.3105 655.8302 690.4353 714.0763 733.3382 756.7881 764.4118 785.7778 797.0108 833.1429 863.4726 872.7323 888.3521 898.1784 914.6824 917.2063 934.1300 948.9502 958.5035 984.2447 986.6819 1010.4469 1028.6183 1047.0742 1089.4349 1106.9612 1111.0964 1125.6977 1145.8419 1150.1117 1163.4386 1173.2724 1176.1584 1181.8766 1203.3087 1216.7534 1229.9023 1240.4807 1263.6303 1275.7370 1279.0487 1297.2302 1315.9002 1317.6376 1332.0281 1348.9153 1354.8888 1368.6291 1387.9783 1389.1164 1436.4146 1436.6909 1443.4110 1448.2759 1451.5524 1457.1627 1461.9821 1485.1212 1495.7930 1588.1866 1589.8479 1610.1580 1629.0165 2827.3688 2849.0628 2978.5556 2990.1215 2992.8299 3042.8666 3059.1400 3059.8812 3067.1173 3106.9864 3110.9942 3118.5177 3137.1363 3149.2379 3152.8482 3159.5981 3428.4267 3584.2129
redmass: 4.6566 4.8752 3.6458 3.9053 3.7772 4.3858 4.6158 2.5353 4.6621 3.5558 3.9688 3.3723 1.1202 2.9735 3.6921 2.5579 3.5003 3.7595 3.0629 3.2774 4.5787 3.5877 3.5048 2.1478 3.1406 4.5884 3.7898 3.2323 2.9651 3.1513 5.0971 3.5941 1.9837 2.0406 1.6279 2.6152 2.1818 2.2360 1.4193 1.9979 1.6361 1.6960 2.6404 2.1849 2.3067 2.0373 1.5747 2.1764 2.4773 3.0294 2.2038 2.2312 1.9862 2.0174 2.7478 1.5037 2.9676 1.1464 1.3151 1.2655 1.5354 1.9351 1.7544 1.8942 1.5598 1.5499 1.4131 1.5831 1.7664 1.3539 1.5949 1.2310 1.4073 1.3279 2.1087 3.0247 4.6196 1.1551 1.9255 1.1142 1.2397 1.4269 1.8355 1.1878 2.5201 2.8845 7.1023 7.0593 6.3192 6.6696 1.0816 1.0699 1.0631 1.0601 1.0621 1.0889 1.1042 1.0979 1.1029 1.0877 1.0890 1.0880 1.0924 1.0930 1.0931 1.1005 1.0745 1.0660
irintensity: 0.8072 0.6603 0.5804 1.7258 0.3412 1.4560 4.6470 3.0345 1.1284 5.4812 2.5792 6.3422 132.3853 4.1094 7.7090 10.3519 2.8028 7.7919 8.8277 4.7608 2.8024 2.3908 4.2021 10.4551 15.4474 3.4798 14.1961 67.3600 93.2024 106.2724 3.4770 22.2305 20.3699 24.5653 29.1863 21.1207 15.4401 8.0195 5.6809 11.2796 0.9974 2.1715 26.3748 19.1474 0.8655 33.1206 1.3569 3.0962 27.7783 1.5836 2.7183 28.4103 9.1160 4.5125 94.8889 96.0732 21.7994 9.0266 29.1322 19.7299 7.8749 5.8911 5.5230 101.1998 7.1736 1.3993 31.5403 11.2095 45.5155 6.1418 9.0672 4.0878 7.8245 6.2039 2.0696 0.4820 31.2652 5.6568 9.4977 8.9119 15.8123 17.3441 11.7199 16.4543 31.3388 183.0863 8.8926 4.2248 5.7797 13.5904 57.4833 120.2920 21.1923 51.3051 36.5910 36.1041 45.8329 12.5500 26.2368 12.6960 25.4951 4.1855 25.0553 18.4726 2.0423 35.3522 1.5609 38.2115
temp: 298.150 k
press: 1.00000 atm
elementType: 8 7 7 6 6 6 6 6 6 6 6 6 6 6 6 6 6 6 6 6 1 1 1 1 1 1 1 1 1 1 1 1 1 1 1 1 1 1
symmnumber: 1
zpe: 822331.4 jmol-1
zpe.correction: 0.313210 hartree
zpe.thermalcorrener: 0.329206 hartree
zpe.thermalcorrenthalpy: 0.330150 hartree
zpe.thermalcorrgfe: 0.270673 hartree
zpe.sumelectzpe: -841.881304 hartree
zpe.sumelectthermal: -841.865307 hartree
zpe.sumelectthermalent: -841.864363 hartree
zpe.sumelectthermalfe: -841.923840 hartree
dipole: 0.1062 -1.6669 -2.1228
dipole: 2.7011
quadrupole: -115.6611 -109.4820 -114.6187
quadrupole: -8.5648 0.9445 7.6263
quadrupole: -2.4072 3.7719 -1.3647 -8.5648 0.9445 7.6263
hfenergy: -842.194513 hartree
pointgroup: C01 [X(C17H18N2O1)]
dipole: -0.1223947 -0.6370794 0.8417019 debye
polarizability: 230.5684951|-1.6220119|221.8027433|6.0916438|-17.2747696|141.992492 unknown
InChI: InChI=1S/C17H18N2O/c20-14-5-6-16-13(10-14)9-12-3-1-2-4-15(12)17-11-18-7-8-19(16)17/h1-6,10,17-18,20H,7-9,11H2
charge 0 multiplicity 1
38 atoms
O  -4.818514 1.338924 0.137623
N  0.099809 -1.493138 -0.052711
N  2.556474 -3.063301 -0.225972
C  1.386329 -0.887424 0.417327
C  2.561326 -1.593645 -0.355293
C  0.067694 -2.954495 0.186819
C  1.550159 0.626996 0.300292
C  -1.135997 -0.781923 0.083185
C  1.235797 -3.63949 -0.564375
C  0.926891 1.436859 -0.692364
C  -0.181522 0.870545 -1.574842
C  -1.334256 0.394918 -0.706791
C  2.484886 1.228424 1.182895
C  -2.205406 -1.252415 0.886694
C  1.270618 2.807683 -0.781538
C  -2.561523 1.080727 -0.653819
C  2.823007 2.594603 1.085972
C  -3.444852 -0.574529 0.921351
C  2.216873 3.39108 0.089283
C  -3.616628 0.599263 0.155031
H  1.518113 -1.149771 1.499825
H  2.470184 -1.329707 -1.426698
H  3.525558 -1.199253 0.010867
H  -0.895176 -3.349212 -0.184325
H  0.141701 -3.197341 1.278129
H  1.244718 -4.722839 -0.343684
H  1.073518 -3.51337 -1.651815
H  2.877826 -3.364931 0.705036
H  -0.522203 1.638536 -2.290579
H  0.198708 0.003361 -2.15081
H  2.952807 0.611781 1.961504
H  -2.075594 -2.150355 1.49943
H  0.778019 3.426983 -1.541063
H  -2.724432 1.984131 -1.250341
H  3.545176 3.033076 1.783473
H  -4.260776 -0.956355 1.549248
H  2.466447 4.454174 -0.000159
H  -5.486858 0.92893 0.740496
