program: Gaussian 09
title: 000195755
version: EM64L-G09RevD.01
frameworkgroup: C1[X(C8H14O5)]
method: RPBEPBE
basis: SDD
operation: Freq
keyword: #pfreq=noraman
keyword: PBEPBE/SDD
title: #p freq=noraman PBEPBE/SDD
converged: YES YES NO NO
title: Mulliken charges:
elementType: O O O O O C C C C C C C C H H H H H H H H H H H H H H
charge: -0.274472 -0.282419 -0.457924 -0.442212 -0.438594 -0.239479 -0.151482 -0.082910 -0.016078 -0.327527 -0.293593 -0.056650 -0.555350 0.247808 0.241316 0.272001 0.259623 0.203368 0.222677 0.364785 0.365208 0.201119 0.211836 0.351022 0.233813 0.221953 0.222162
chargesum: 0.00000
title: Mulliken charges with hydrogens summed into heavy atoms:
elementType: O O O O O C C C C C C C C
charge: -0.274472 -0.282419 -0.093139 -0.077004 -0.087572 0.008329 0.089834 0.189091 0.243546 0.098518 0.119362 0.177163 -0.111236
polarizability: 1.24282466e+02 8.17615154e+00 9.88536067e+01 4.11070741e+00 1.95394452e+00 8.24968182e+01
1716.lowfreq: -12.4905 -0.0008 -0.0007 0.0006 2.4840 12.5036 24.0353 37.0298 49.9853
frequency: 23.5301 36.9001 49.9292 86.5083 100.6377 109.6711 160.5424 187.3971 235.1587 251.3397 282.1325 298.5628 309.8743 358.2563 367.4031 443.1141 467.8677 508.4752 538.6169 556.9876 579.9901 643.1651 714.9012 754.3033 792.7610 853.1142 885.1881 900.0418 941.7264 954.4924 965.0747 972.4973 989.6318 1001.4142 1012.4735 1026.4020 1028.1334 1047.1516 1072.4208 1094.7433 1147.0649 1175.2025 1181.5307 1206.3849 1213.1288 1250.5806 1269.6036 1280.1595 1281.5398 1296.4816 1304.2041 1321.4677 1338.4759 1356.7062 1372.9935 1380.3547 1389.5666 1432.2677 1464.5877 1473.3695 1664.1485 2932.8105 2960.5349 3021.8285 3022.8462 3038.3929 3042.0343 3054.3983 3071.1822 3091.7726 3118.3590 3202.2527 3432.3821 3528.4675 3576.7695
redmass: 4.1874 5.0990 2.7377 4.0086 3.3556 3.1889 3.6971 3.8853 1.8727 4.8759 3.3671 4.4604 2.0824 3.6241 4.0537 2.5246 1.2197 2.6928 2.5584 1.2393 4.4881 1.9383 4.7754 5.5514 3.2042 3.6855 3.0470 2.8071 2.4004 1.6392 1.8346 3.4521 2.7676 1.8301 1.8118 2.3326 3.7592 3.5531 2.6896 2.4218 1.6590 1.1567 1.2923 1.2377 1.2324 1.2737 1.3118 1.2699 1.2387 1.2071 1.3716 1.2527 1.1743 1.2860 1.4178 1.3321 1.5131 1.1996 1.0862 1.0943 4.7798 1.0629 1.0668 1.0931 1.0901 1.0868 1.0891 1.0868 1.0967 1.0604 1.0948 1.1144 1.0648 1.0652 1.0666
irintensity: 0.2202 2.9646 0.5147 3.0966 5.1752 8.2078 6.2201 1.1259 73.2064 2.1990 10.0059 3.6463 30.1869 3.6090 10.1027 6.6707 108.5224 5.5427 74.9268 78.0845 3.5858 14.2907 11.5374 56.9880 15.8228 45.0514 102.1260 98.9522 18.8254 134.2555 26.7290 85.1194 96.3227 43.7323 6.0891 20.3460 205.2222 12.0477 29.8021 13.0938 4.3939 38.7190 46.9408 10.8737 2.7034 15.5755 4.3081 5.4712 0.0386 12.5077 14.8215 4.9344 6.1830 39.3340 59.7786 19.6161 16.1892 16.2253 5.0615 4.9974 3.5144 45.3115 45.8219 9.0874 27.9752 50.7987 30.6064 9.4589 39.4330 9.5845 9.8614 25.5013 55.5652 7.1917 16.1590
temp: 298.150 k
press: 1.00000 atm
elementType: 8 8 8 8 8 6 6 6 6 6 6 6 6 1 1 1 1 1 1 1 1 1 1 1 1 1 1
symmnumber: 1
zpe: 571195.2 jmol-1
zpe.correction: 0.217557 hartree
zpe.thermalcorrener: 0.231907 hartree
zpe.thermalcorrenthalpy: 0.232851 hartree
zpe.thermalcorrgfe: 0.174743 hartree
zpe.sumelectzpe: -688.246439 hartree
zpe.sumelectthermal: -688.232089 hartree
zpe.sumelectthermalent: -688.231145 hartree
zpe.sumelectthermalfe: -688.289253 hartree
dipole: 0.5954 -1.5973 2.8250
dipole: 3.2995
quadrupole: -69.3859 -91.4471 -73.4574
quadrupole: -0.1055 -9.8094 -1.7657
quadrupole: 8.7109 -13.3503 4.6394 -0.1055 -9.8094 -1.7657
hfenergy: -688.4639961 hartree
pointgroup: C01 [X(C8H14O5)]
dipole: 0.3848823 -0.5531888 1.1094798 debye
polarizability: 118.8466471|13.2602018|104.2973966|3.4300223|2.9106767|82.4888472 unknown
InChI: InChI=1S/C8H14O5/c1-2-3-12-8-7(11)6(10)5(4-9)13-8/h2,5-11H,1,3-4H2
charge 0 multiplicity 1
27 atoms
O  -0.566062 0.174927 -1.204514
O  1.264741 -0.693243 0.141359
O  -3.099355 -0.957593 0.961681
O  -1.745119 -2.577953 -0.679336
O  -0.912683 2.922065 -0.559711
C  -1.674409 -0.602934 0.826144
C  -0.870327 -1.770146 0.156165
C  -1.568796 0.577751 -0.166895
C  0.141225 -1.019843 -0.722879
C  -1.09888 1.895173 0.465528
C  2.382443 -0.021833 -0.567792
C  3.570113 -0.004013 0.356978
C  4.27709 1.111005 0.664376
H  -1.23101 -0.350623 1.807705
H  -0.354623 -2.410619 0.893955
H  -2.525047 0.721428 -0.698972
H  0.458699 -1.573453 -1.625445
H  -0.159252 1.718275 1.031628
H  -1.869879 2.290665 1.149699
H  -3.254541 -1.414971 1.825915
H  -2.680792 -2.306252 -0.459931
H  2.607993 -0.602399 -1.49058
H  2.083647 1.001989 -0.864333
H  -0.387832 2.504216 -1.29244
H  3.858172 -0.979393 0.772445
H  5.156057 1.070148 1.316758
H  3.998926 2.096723 0.270893
