program: Gaussian 09
title: 000195742
version: EM64L-G09RevD.01
frameworkgroup: C1[X(C4H9N3O3)]
method: RPBEPBE
basis: SDD
operation: Freq
keyword: #pfreq=noraman
keyword: PBEPBE/SDD
title: #p freq=noraman PBEPBE/SDD
converged: YES YES NO NO
title: Mulliken charges:
elementType: O O O N N N C C C C H H H H H H H H H
charge: -0.266750 -0.467571 -0.287203 -0.139024 -0.515521 -0.616722 -0.339940 -0.495235 0.244875 0.222251 0.266240 0.254910 0.265222 0.219845 0.305612 0.308815 0.335423 0.314933 0.389839
chargesum: 0.00000
title: Mulliken charges with hydrogens summed into heavy atoms:
elementType: O O O N N N C C C C
charge: -0.266750 -0.077732 -0.287203 -0.139024 0.098906 0.033635 0.181210 -0.010168 0.244875 0.222251
polarizability: 9.34582711e+01 7.01967015e-01 7.19917969e+01 -2.25176995e+00 3.20747536e+00 6.04506079e+01
1716.lowfreq: -12.1608 -3.6444 -0.0001 0.0006 0.0007 6.6210 22.8902 45.9284 65.1584
frequency: 22.8421 45.8651 65.1364 87.6431 152.0114 181.9482 228.5499 272.6068 314.7448 377.4016 432.7029 498.0243 517.5714 530.2667 546.7860 550.4869 605.9661 666.2779 686.7592 729.6238 782.6050 816.7642 876.2231 975.9089 1026.9432 1062.6122 1075.4308 1140.4943 1219.5994 1248.8926 1259.6160 1280.2364 1294.8208 1345.0921 1374.8852 1399.2062 1445.5203 1463.3568 1595.3797 1642.1302 1661.6400 1674.7496 2986.7058 3034.5628 3050.4201 3108.4095 3397.2865 3516.4799 3522.0010 3578.9581 3673.9360
redmass: 5.3388 5.4578 3.2216 4.0952 4.8746 3.1257 1.2778 3.9397 3.9578 3.3029 2.6852 1.4447 2.1168 1.1104 2.7914 3.2039 2.5469 2.0317 8.3336 2.8849 1.4567 1.9485 3.0268 3.9174 2.0011 2.8790 2.1156 1.4159 1.3675 2.2099 1.4341 1.7128 1.3578 1.9125 1.8499 3.1363 1.1043 1.0865 1.4750 3.3346 1.8405 1.9432 1.0589 1.0612 1.1004 1.1047 1.0438 1.0447 1.0985 1.0648 1.1043
irintensity: 9.1050 6.4915 0.7152 2.1592 4.0289 6.1914 43.0740 7.8126 8.4039 15.6360 11.7104 59.3952 109.3745 139.4288 51.5283 91.9517 35.5767 44.3200 24.1276 63.8752 15.1435 83.2481 22.8373 79.1709 46.0935 52.2889 38.8911 166.7529 4.7618 34.2390 13.7910 6.6007 6.2069 128.3596 121.7323 87.0526 6.6433 34.4528 63.2896 300.9200 198.0110 201.3097 15.0531 8.1354 16.4345 4.6266 0.5471 30.2770 6.5775 54.0227 22.4458
temp: 298.150 k
press: 1.00000 atm
elementType: 8 8 8 7 7 7 6 6 6 6 1 1 1 1 1 1 1 1 1
symmnumber: 1
zpe: 389050.0 jmol-1
zpe.correction: 0.148181 hartree
zpe.thermalcorrener: 0.159533 hartree
zpe.thermalcorrenthalpy: 0.160477 hartree
zpe.thermalcorrgfe: 0.109276 hartree
zpe.sumelectzpe: -546.955093 hartree
zpe.sumelectthermal: -546.943741 hartree
zpe.sumelectthermalent: -546.942797 hartree
zpe.sumelectthermalfe: -546.993998 hartree
dipole: 0.9445 0.0480 -3.9039
dipole: 4.0168
quadrupole: -48.1752 -62.5105 -57.7991
quadrupole: 12.5544 8.3743 2.9290
quadrupole: 7.9864 -6.3489 -1.6375 12.5544 8.3743 2.9290
hfenergy: -547.1032739 hartree
pointgroup: C01 [X(C4H9N3O3)]
dipole: 0.4138018 0.1480837 -1.5180065 debye
dipolederiv: -0.7070137 0.0650511 0.1672828 -0.0438108 -0.4879993 -0.2368995 -0.0071641 -0.259881 -0.9080654 -1.3201988 -0.1688362 0.1936057 -0.3335906 -0.3104442 0.060102 0.2872522 0.0212467 -0.5062839 -0.6274952 0.0302663 0.0442936 0.1531306 -1.2339479 0.1387435 0.0556176 0.0851639 -0.3878178 -0.7341856 0.5473499 -0.0721232 0.4183977 -0.4274621 -0.0743807 0.0241341 -0.0918636 -0.3003295 -0.4671477 0.1515778 0.0251012 0.1053911 -0.2250696 0.0653534 0.0392531 0.0297521 -0.0395442 -0.7787207 -0.214569 -0.4982763 -0.1985448 -0.7423345 -0.0548892 -0.3537194 -0.0337333 -0.691961 0.6776631 -0.0486924 0.0285259 0.1180564 0.0525059 0.0081127 0.0547325 0.0656443 0.2155307 -0.5111334 -0.0080419 0.0524561 -0.108759 0.1418578 0.0300976 0.0950276 0.0260534 -0.0608489 1.3305826 0.2255696 0.1860315 0.3243127 0.4909478 0.5066753 0.1079231 0.5135961 1.2049387 1.7952025 -0.3341645 -0.275958 -0.4426467 1.6120604 -0.1608727 -0.3537561 -0.075053 0.3570744 0.0519954 0.0217094 0.0207692 0.0063468 0.0520312 -0.0945345 -0.0049334 -0.0676646 -0.0002734 0.0627099 0.0118101 -0.0243411 -0.0360825 -0.0184887 0.0695824 -0.0292636 0.031138 0.080166 0.1264114 -0.0080854 0.0257043 0.0481576 -0.0196685 0.0766648 0.0254558 0.036049 0.0571851 0.023296 0.0087731 0.0036021 0.0230552 -0.0132114 -0.1312581 -0.0118783 -0.1038501 -0.0554229 0.1586312 -0.1932665 -0.0897662 -0.0479902 0.17622 0.0355838 -0.0764649 0.0128526 0.1068677 0.1953124 -0.0973155 0.1240518 -0.028863 0.1544975 -0.0646146 0.0745262 -0.0415243 0.1383836 0.1489041 -0.0148841 0.0290046 -0.042013 0.3376479 -0.0871568 0.0220113 -0.0842202 0.2096843 0.1997611 -0.0062024 0.051991 -0.0003887 0.322694 -0.1001545 0.0537949 -0.0961357 0.1833597 0.3754254 0.0319508 0.0080448 0.0858414 0.1381637 0.0138452 -0.0025487 0.0324299 0.397357 unknown
polarizability: 93.5520064|-0.5709664|71.2135671|-1.2133782|4.4044371|61.1351023 unknown
InChI: InChI=1S/C4H9N3O3/c5-3(8)1-2-7(6)4(9)10/h9H,1-2,5-6H2
charge 0 multiplicity 1
19 atoms
O  -2.921796 0.725587 0.994273
O  3.446773 -0.074824 -0.366101
O  2.017811 -1.834453 0.257812
N  1.255519 0.395661 0.158588
N  1.534481 1.75771 -0.163677
N  -3.482636 -0.344721 -0.984324
C  -0.130934 0.088814 0.561225
C  -1.116593 0.261408 -0.613706
C  -2.567691 0.234761 -0.11884
C  2.198106 -0.605683 0.049369
H  -0.433026 0.770315 1.374873
H  -0.142328 -0.943924 0.94534
H  -0.928369 1.256516 -1.063496
H  -0.938087 -0.504881 -1.390669
H  2.084356 2.207094 0.582642
H  2.02094 1.825682 -1.067171
H  -4.466443 -0.357077 -0.714808
H  -3.202541 -0.763333 -1.869249
H  4.080757 -0.834855 -0.42428
