program: Gaussian 09
title: 000017255
version: EM64L-G09RevD.01
frameworkgroup: C1[X(C19H14)]
method: RPBEPBE
basis: SDD
operation: Freq
keyword: #p
keyword: freq=noraman
keyword: PBEPBE/SDD
title: #p freq=noraman PBEPBE/SDD
converged: YES YES NO YES
title: Mulliken charges:
elementType: C C C C C C C C C C C C C C C C C C C H H H H H H H H H H H H H H
charge: 0.223827 0.199030 0.473034 0.438936 -0.615554 0.415591 0.401862 -0.713115 -0.499159 -0.573456 -0.476308 0.458806 -0.447674 -0.383697 -0.436560 -0.425675 -0.246627 -0.818209 -0.243216 0.229497 0.245410 0.239426 0.225139 0.234968 0.236905 0.232195 0.241267 0.241370 0.230584 0.230574 0.225298 0.227703 0.227830
chargesum: 0.00000
title: Mulliken charges with hydrogens summed into heavy atoms:
elementType: C C C C C C C C C C C C C C C C C C C
charge: 0.223827 0.199030 0.473034 0.438936 -0.386057 0.415591 0.401862 -0.467705 -0.259733 -0.348317 -0.241340 0.458806 -0.210769 -0.151502 -0.195294 -0.184306 -0.018925 -0.131753 -0.015387
polarizability: 3.98081980e+02 1.01358795e+01 2.28013286e+02 -2.05449627e-02 1.52282150e-02 8.16637962e+01
1716.lowfreq: -6.6832 -0.0006 -0.0006 0.0003 4.8726 8.7716 56.8709 63.8567 67.1515
frequency: 56.8678 63.8506 67.1483 133.8093 135.1995 159.3095 230.8421 260.5553 288.2671 307.5831 314.7044 382.7400 405.5894 427.9525 430.1092 462.4785 471.2398 510.9977 529.3334 562.0620 572.8005 586.9232 621.2504 651.7282 691.6659 705.7976 734.3367 753.8702 775.3639 781.6715 801.2997 806.6801 829.6266 849.4741 860.5805 876.9016 899.6125 904.6420 911.0155 934.9761 963.9120 967.6770 982.6022 985.9308 989.5211 1017.4861 1028.3660 1048.2174 1100.9632 1137.8052 1163.1735 1172.2499 1193.7567 1200.0870 1223.0549 1235.1286 1247.9764 1281.2496 1288.0754 1302.4253 1327.9633 1386.0521 1391.9136 1398.8722 1414.1724 1418.2965 1437.0140 1446.9551 1452.6075 1469.4921 1472.9376 1485.0271 1516.3483 1550.3908 1566.9320 1596.8266 1625.0147 1628.2066 1639.8372 2974.0338 3051.3027 3083.1409 3115.5660 3116.2636 3118.1523 3118.6941 3123.5770 3129.1981 3139.1279 3141.6705 3142.3643 3143.9258 3161.5553
redmass: 2.6683 1.4662 2.5969 4.3307 3.8126 4.1953 3.6895 3.8659 4.3207 3.6128 5.3399 4.2604 3.1426 2.9207 5.2863 4.2027 2.4693 6.0128 3.2275 3.3951 6.8697 3.1603 6.6221 6.5611 5.5960 2.8746 5.8525 1.2602 4.9763 2.5657 1.5094 1.7471 4.9983 1.4789 1.5139 4.2230 1.5762 1.6133 5.4329 2.0951 1.3738 1.3996 1.7973 1.4132 1.3718 2.2761 2.1200 1.5607 2.2618 1.5580 1.2554 1.0933 1.3176 1.8489 2.1311 1.7202 1.8859 2.2563 1.5602 2.0460 2.4211 3.0306 3.3821 1.3061 3.8577 2.3190 5.8481 3.5419 2.8731 1.0459 1.4410 2.0621 3.5783 5.4492 7.1415 5.6602 6.1627 6.7284 6.9019 1.0374 1.0975 1.0987 1.0877 1.0889 1.0865 1.0862 1.0888 1.0913 1.0942 1.0947 1.0942 1.0964 1.1003
irintensity: 0.6836 0.6174 0.1684 0.2615 1.9583 0.4090 0.2089 1.5235 0.2327 0.1649 0.5589 0.3947 0.0127 5.5370 0.6389 0.3718 19.7177 0.0602 9.4546 0.4472 5.7180 6.8795 2.2063 3.4053 0.1774 2.7963 0.0292 63.3199 0.0438 0.5590 9.3596 0.0657 1.3904 33.8848 2.5385 4.2399 9.6071 76.5024 0.7589 3.6233 1.3550 15.9265 1.6275 0.0174 0.1100 7.7390 6.7491 12.3883 1.2528 8.6341 7.1683 1.8592 5.0583 0.6105 1.8360 1.4947 11.2306 0.7825 3.3442 0.7284 0.6781 0.8637 11.2351 4.9840 2.8111 1.1401 0.0762 3.3454 1.5930 12.8729 6.3529 14.6487 29.6212 6.0125 0.1364 0.1992 13.8224 7.0325 0.8204 45.3379 20.6598 16.0334 0.4303 14.9479 0.1802 7.9895 1.0017 4.3876 25.0441 0.9570 67.9974 30.5882 48.2616
temp: 298.150 k
press: 1.00000 atm
elementType: 6 6 6 6 6 6 6 6 6 6 6 6 6 6 6 6 6 6 6 1 1 1 1 1 1 1 1 1 1 1 1 1 1
symmnumber: 1
zpe: 694216.6 jmol-1
zpe.correction: 0.264413 hartree
zpe.thermalcorrener: 0.278603 hartree
zpe.thermalcorrenthalpy: 0.279547 hartree
zpe.thermalcorrgfe: 0.223277 hartree
zpe.sumelectzpe: -731.196181 hartree
zpe.sumelectthermal: -731.181991 hartree
zpe.sumelectthermalent: -731.181047 hartree
zpe.sumelectthermalfe: -731.237317 hartree
dipole: 0.5605 -0.4420 0.0008
dipole: 0.7138
quadrupole: -92.0527 -94.3458 -119.1726
quadrupole: -1.7948 -0.0007 0.0021
quadrupole: 9.8043 7.5112 -17.3155 -1.7948 -0.0007 0.0021
hfenergy: -731.4605946 hartree
pointgroup: C01 [X(C19H14)]
dipole: 0.2165104 0.1788663 -0.0000622 debye
polarizability: 398.4439777|-6.247944|227.6295313|-1.8828832|1.2786607|81.6855535 unknown
InChI: InChI=1S/C19H14/c1-13-6-7-14-8-9-17-11-15-4-2-3-5-16(15)12-19(17)18(14)10-13/h2-12H,1H3
charge 0 multiplicity 1
33 atoms
C  0.115939 -0.13305 -0.002138
C  1.579869 0.031614 -0.009241
C  -0.44253 -1.480776 -0.01065
C  2.416189 -1.139908 -0.023702
C  -0.780389 0.956221 0.012606
C  -2.191973 0.781729 0.019272
C  -2.742044 -0.564878 0.010576
C  -1.842586 -1.662677 -0.004192
C  0.44917 -2.624198 -0.025538
C  2.214291 1.309912 -0.002406
C  1.817321 -2.460769 -0.031603
C  3.613698 1.458777 -0.009007
C  3.834708 -0.985714 -0.030153
C  4.424586 0.282929 -0.022812
C  -3.098001 1.899151 0.034416
C  -4.170582 -0.734754 0.017318
C  -4.477447 1.700826 0.040628
C  4.261772 2.831893 -0.002985
C  -5.019516 0.370086 0.031982
H  -0.399496 1.983131 0.019675
H  -2.24529 -2.683642 -0.010781
H  0.006095 -3.627024 -0.03187
H  1.602683 2.218432 0.00837
H  2.483289 -3.331851 -0.042724
H  4.462454 -1.884994 -0.040826
H  5.516833 0.382846 -0.027744
H  -2.684281 2.91486 0.041035
H  -4.581494 -1.751505 0.01066
H  4.910161 2.965945 0.883607
H  4.899938 2.978136 -0.895136
H  3.507816 3.637445 0.006673
H  -5.158114 2.559193 0.052163
H  -6.106267 0.231416 0.037025
