program: Gaussian 09
title: 000195787
version: EM64L-G09RevD.01
frameworkgroup: C1[X(C19H18O5)]
method: RPBEPBE
basis: SDD
operation: Freq
keyword: #pfreq=noraman
keyword: PBEPBE/SDD
title: #p freq=noraman PBEPBE/SDD
converged: YES YES NO NO
title: Mulliken charges:
elementType: O O O O O C C C C C C C C C C C C C C C C C C C H H H H H H H H H H H H H H H H H H
charge: -0.177288 -0.422381 -0.208295 -0.377334 -0.421513 -0.396723 -0.586750 -0.004196 0.495368 0.084852 0.309895 -0.178155 0.176724 -0.580511 -0.705991 -0.721601 0.349862 -0.257078 -0.613798 0.318011 0.193216 -0.611929 -0.573386 0.354134 0.197617 0.238455 0.264674 0.201519 0.183536 0.268791 0.199391 0.219940 0.221309 0.210453 0.210542 0.211219 0.288749 0.291959 0.250729 0.365311 0.361875 0.368798
chargesum: 0.00000
title: Mulliken charges with hydrogens summed into heavy atoms:
elementType: O O O O O C C C C C C C C C C C C C C C C C C C
charge: -0.177288 -0.057070 -0.208295 -0.015459 -0.052715 0.039350 -0.120557 0.179340 0.495368 0.084852 0.309895 -0.178155 0.176724 -0.311720 -0.065351 -0.089388 0.349862 -0.257078 -0.325049 0.318011 0.193216 -0.319970 -0.322657 0.354134
polarizability: 3.35137967e+02 1.99575413e+01 2.91456229e+02 -1.65919809e+01 1.26980871e+01 1.17418865e+02
1716.lowfreq: -0.0006 -0.0004 0.0007 1.8844 5.7305 10.6656 23.5243 27.4414 32.8082
frequency: 23.4250 26.8843 32.6011 41.7661 60.6445 82.7397 123.0402 142.2399 169.1155 170.0028 186.4211 199.6883 211.4613 217.8024 235.4070 257.2623 261.7171 274.1902 310.0960 336.5380 358.3563 366.1056 371.8909 385.8755 396.0598 403.6967 407.9790 426.6461 431.4152 436.3203 457.9714 473.7140 490.3940 534.9201 554.2755 578.5573 593.8167 599.8253 613.7165 626.7950 657.6058 709.4037 728.3296 752.9372 767.0422 774.8624 824.1489 845.0086 854.3213 868.4157 885.7869 903.3046 916.0173 920.5960 923.1760 934.3753 954.3688 973.0427 986.4515 995.7358 1035.0271 1065.9715 1094.7108 1121.3305 1129.1590 1140.6769 1156.4846 1166.9199 1175.1497 1176.0204 1185.2390 1209.5032 1235.7504 1243.2822 1264.3800 1270.3129 1292.7197 1311.4287 1318.3368 1331.9606 1339.8784 1354.3406 1376.0245 1396.2363 1400.4030 1422.7016 1431.3704 1448.2392 1450.1429 1455.2606 1467.2357 1469.2594 1473.2301 1478.4963 1480.6658 1487.9603 1530.0243 1547.2686 1573.8448 1600.7601 1612.0511 1629.0216 2947.2984 2964.8204 2969.1153 2977.1345 2983.3432 3041.8237 3061.2812 3064.5045 3070.6743 3077.6267 3094.7856 3131.6069 3137.6031 3143.7495 3154.6238 3533.4577 3576.8114 3582.1546
redmass: 5.1569 2.8733 5.8964 4.6587 8.1147 3.6168 2.7371 8.6020 6.6836 3.8156 2.3711 1.3891 4.4879 3.2797 1.2727 6.3059 6.1303 5.1410 4.4110 3.6755 6.8527 3.6546 3.0960 6.3016 3.1755 1.1487 1.1252 1.5685 2.0509 2.8072 8.5602 5.9367 4.4294 8.0211 4.6523 5.1847 5.9839 5.1183 4.3133 4.4209 3.4081 5.8512 4.4579 4.8740 3.2100 1.6858 2.4343 1.6593 2.8927 5.1287 1.5129 1.6393 1.1782 2.4785 3.0232 2.3295 1.3980 2.3896 3.0325 4.7540 3.3123 2.3700 3.1352 1.6827 2.2503 1.6184 1.3027 1.9643 1.7728 1.6595 1.4070 1.6042 1.6605 1.8364 1.3964 2.0836 1.4026 1.5521 3.9287 1.3867 1.4637 6.6705 1.2120 1.3394 4.0071 6.1143 3.3912 4.3374 2.7506 1.2374 1.0720 1.1078 1.0906 4.0322 1.0655 1.0502 6.7256 9.4535 7.1525 7.6789 6.1358 7.0502 1.0832 1.0396 1.0567 1.0367 1.0681 1.0968 1.0995 1.0997 1.0991 1.0990 1.0940 1.0920 1.0921 1.0923 1.0918 1.0656 1.0660 1.0662
irintensity: 1.8488 0.2217 0.4455 2.1689 0.2346 0.0447 0.2920 1.8033 0.3756 0.1147 0.3540 0.5223 0.9604 4.3722 0.2957 5.3870 3.0086 6.0635 3.3791 6.3923 12.8991 5.3290 3.5691 9.9198 1.6004 58.9314 154.5782 124.7270 61.3277 7.3729 5.9622 5.5798 33.2449 3.2436 1.1643 3.7127 17.7680 0.9144 4.7255 6.0578 20.0032 1.7127 5.5218 29.5221 12.3305 20.6838 3.1226 32.5098 18.6855 11.5994 0.9963 16.4460 2.9422 24.5245 7.7762 6.9769 1.6350 16.2870 48.2492 79.4960 31.0484 43.8327 206.3083 1.9279 5.2365 401.7793 3.5473 84.3038 22.4748 68.5627 56.1655 7.6982 23.6424 14.3715 65.1376 256.5430 114.9182 33.5727 33.7607 8.6611 5.5030 435.6532 18.5262 21.1945 2.5820 5.5830 1.8359 42.2028 28.1435 3.6302 8.0321 20.9635 8.9147 5.8154 14.6504 33.8333 103.2872 321.3722 141.5793 61.7069 82.3382 146.8947 28.4176 22.8255 57.2020 19.3202 39.3964 11.3991 33.8759 21.1495 108.1565 53.3186 15.2175 10.6059 6.0113 5.5562 6.1558 29.8853 69.3910 79.4090
temp: 298.150 k
press: 1.00000 atm
elementType: 8 8 8 8 8 6 6 6 6 6 6 6 6 6 6 6 6 6 6 6 6 6 6 6 1 1 1 1 1 1 1 1 1 1 1 1 1 1 1 1 1 1
symmnumber: 1
zpe: 854776.7 jmol-1
zpe.correction: 0.325567 hartree
zpe.thermalcorrener: 0.347818 hartree
zpe.thermalcorrenthalpy: 0.348763 hartree
zpe.thermalcorrgfe: 0.273457 hartree
zpe.sumelectzpe: -1109.228426 hartree
zpe.sumelectthermal: -1109.206175 hartree
zpe.sumelectthermalent: -1109.205231 hartree
zpe.sumelectthermalfe: -1109.280537 hartree
dipole: -2.6439 0.5469 -0.2848
dipole: 2.7149
quadrupole: -125.1147 -126.7174 -143.0078
quadrupole: 6.5968 -0.7037 2.1981
quadrupole: 6.4986 4.8959 -11.3945 6.5968 -0.7037 2.1981
hfenergy: -1109.5539934 hartree
pointgroup: C01 [X(C19H18O5)]
dipole: -1.0200177 0.2963696 -0.1122073 debye
polarizability: 338.1509024|16.7506635|287.6548684|-13.0257129|19.4451827|118.2072904 unknown
InChI: InChI=1S/C19H18O5/c1-9(2)3-4-10-5-11(20)6-13-16(10)19(24)17-14(18(13)23)7-12(21)8-15(17)22/h5-9,20-22H,3-4H2,1-2H3
charge 0 multiplicity 1
42 atoms
O  0.48747 -1.804807 -0.204299
O  2.449355 4.392443 -0.011056
O  -2.349576 2.797172 0.716181
O  -1.783064 -3.116817 -0.662998
O  -5.916042 -0.834416 0.263849
C  3.467746 -1.06424 0.49734
C  2.855286 -0.412757 -0.776055
C  4.475813 -2.204413 0.190271
C  1.923057 0.741124 -0.43748
C  0.514373 0.613453 -0.16534
C  -0.232642 1.796119 0.138304
C  -0.178464 -0.719517 -0.174825
C  -1.673012 -0.740442 -0.112406
C  2.508571 2.02745 -0.382051
C  3.794053 -3.413463 -0.495265
C  5.181511 -2.648575 1.494411
C  -2.407041 0.444868 0.199382
C  -1.702628 1.750478 0.385911
C  0.379961 3.065899 0.208077
C  1.758654 3.1765 -0.051201
C  -2.436901 -1.939273 -0.313533
C  -3.810464 0.45238 0.337214
C  -3.845295 -1.934973 -0.182562
C  -4.526171 -0.747113 0.147749
H  3.978227 -0.277232 1.090314
H  2.647098 -1.467684 1.120323
H  2.322799 -1.190179 -1.344453
H  3.683553 -0.024553 -1.40195
H  5.249941 -1.802559 -0.500106
H  3.574931 2.148938 -0.598299
H  4.520879 -4.230798 -0.661667
H  3.358969 -3.144761 -1.474185
H  2.972409 -3.801937 0.134976
H  5.707054 -1.803233 1.977561
H  4.444543 -3.047232 2.218132
H  5.923678 -3.444461 1.296184
H  -0.248004 3.929742 0.457486
H  -4.299164 1.401209 0.586901
H  -4.430537 -2.848994 -0.336729
H  1.844491 5.139385 0.225415
H  -2.439244 -3.849459 -0.794648
H  -6.309876 0.042927 0.497126
