program: Gaussian 09
title: 000195686
version: EM64L-G09RevD.01
frameworkgroup: C1[X(C18H17N3O3)]
method: RPBEPBE
basis: SDD
operation: Freq
keyword: #p
keyword: freq=noraman
keyword: PBEPBE/SDD
title: #p freq=noraman PBEPBE/SDD
converged: YES YES NO NO
title: Mulliken charges:
elementType: O O O N N N C C C C C C C C C C C C C C C C C C H H H H H H H H H H H H H H H H H
charge: -0.477316 -0.153394 -0.184169 -0.045873 -0.056146 0.027110 -0.591982 0.440395 0.375343 -0.129003 -0.126535 0.376192 -0.299345 -0.306654 0.168120 -0.508734 -0.276876 -0.276478 0.403747 -0.316251 -0.131685 -0.151830 -0.333629 -0.571742 0.309585 0.273118 0.304674 0.350694 0.283720 0.281619 0.294473 0.286207 0.286903 0.266152 0.312229 0.308046 0.317721 0.266941 0.298338 0.300104 0.406210
chargesum: 2.00000
title: Mulliken charges with hydrogens summed into heavy atoms:
elementType: O O O N N N C C C C C C C C C C C C C C C C C C
charge: -0.071107 -0.153394 -0.184169 -0.045873 -0.056146 0.027110 -0.009280 0.440395 0.375343 0.175671 0.224159 0.376192 -0.015625 -0.025035 0.168120 -0.214260 0.009332 0.010425 0.403747 -0.050099 0.180543 0.156216 -0.015908 0.293641
polarizability: 5.90660583e+02 4.05034201e+01 2.27873213e+02 -1.77168408e+01 1.92899837e+01 1.53552019e+02
1716.lowfreq: -12.3763 -5.1174 -2.2524 -0.0008 -0.0006 -0.0001 9.9242 18.1588 34.0083
frequency: 8.6632 18.1191 33.9700 37.3609 53.7163 62.2453 75.1367 82.3607 119.9022 143.5377 171.2971 178.1827 229.7150 246.7559 279.6580 319.5398 337.4304 346.8740 350.0038 393.7773 397.6605 402.0023 413.8386 441.7157 451.3592 455.4482 504.8884 516.7006 527.7144 550.6037 559.7614 608.6885 616.0308 653.0014 654.9943 666.1038 698.0253 722.3477 730.5771 743.0747 750.1971 765.4903 789.5316 811.7936 841.6869 846.0158 864.8920 866.8368 881.8904 911.2588 943.8673 955.8879 978.0103 980.1448 985.9469 992.3980 996.2166 1022.6299 1043.9014 1045.1780 1061.3254 1070.6238 1101.3968 1106.6432 1122.3494 1123.3490 1160.0495 1162.0702 1165.0067 1192.3612 1201.0067 1216.9151 1232.4864 1241.0078 1254.6984 1290.3980 1299.2271 1307.2077 1335.2434 1346.5005 1353.5154 1367.5521 1375.0796 1411.3350 1430.0587 1433.5643 1439.0887 1453.8740 1458.3985 1464.6515 1474.5240 1485.9835 1497.3405 1523.7832 1538.2132 1556.9863 1600.7355 1614.2345 1629.4565 1635.3976 3025.3251 3051.7769 3122.2217 3130.6296 3147.6676 3155.1215 3155.1595 3165.3602 3178.4072 3180.1646 3182.6781 3185.4743 3185.5345 3199.3344 3201.8477 3206.5170 3579.2545
redmass: 4.3555 6.6880 1.3076 2.6955 8.4811 4.0801 5.5858 4.6822 7.0067 5.0544 5.9352 5.3762 4.9497 5.9084 5.8567 5.0794 5.2145 4.1711 6.0794 2.5247 2.7036 2.7131 4.2158 2.9354 3.1742 1.2907 3.8436 3.8224 5.2120 5.1360 3.0164 4.5638 8.0846 6.0916 5.4423 6.6803 5.5223 3.8171 5.3246 3.9117 5.8057 5.4076 3.8748 5.0626 1.4447 1.5131 1.2669 1.3049 1.5988 4.6160 1.5001 1.7889 1.3863 1.3977 1.3976 1.3518 1.4073 6.1685 2.5728 3.0037 1.5570 2.0379 2.5928 3.0290 1.3916 1.5818 1.3238 1.2676 4.2018 5.1561 1.5454 2.0357 1.2053 1.2224 2.4321 1.4197 2.6400 1.7221 1.9059 1.2730 2.1323 2.4442 9.5430 6.9765 1.1983 3.8430 2.1922 1.6138 1.2769 1.0391 1.4088 2.4783 1.7974 2.2681 4.8330 6.5335 6.6808 7.4804 5.1697 5.2693 1.0336 1.0598 1.1079 1.1047 1.0919 1.1040 1.0930 1.0949 1.0922 1.0921 1.0924 1.0967 1.0960 1.0988 1.0996 1.1008 1.0665
irintensity: 1.2628 2.9246 0.8449 0.1737 0.7711 0.3977 0.0577 1.4574 4.1502 1.0269 1.8190 8.0316 0.2516 3.5839 0.7227 7.7443 1.2532 0.9306 1.6588 0.9173 1.6883 2.2111 8.8319 5.4003 21.8789 88.9248 20.3465 26.6970 1.3531 4.9489 4.1985 25.5155 13.0026 5.6493 12.6368 0.6273 8.3547 4.3826 4.2481 1.2967 22.9937 9.9499 31.4471 4.5548 74.8533 69.4424 0.3740 6.4286 17.3854 22.5673 28.3325 1.2024 0.4643 0.0348 0.4972 3.1585 2.5496 2.3860 3.0101 0.3605 2.9649 74.5437 32.0993 9.3424 7.4377 32.4653 6.7652 59.1014 48.0490 45.8475 37.1326 55.1541 8.3583 16.9161 28.6191 7.7357 35.1743 1.3083 0.8687 0.5925 3.8857 7.9768 77.6601 25.0191 11.6941 82.0334 45.2592 15.2427 40.3873 28.6302 14.4892 8.7384 43.7044 12.1208 41.6115 3.9153 33.9269 11.2542 167.9895 306.3691 2.1622 3.8735 0.8468 0.0066 0.6261 3.1944 5.9955 23.8655 0.5606 0.7274 0.4969 10.1289 5.7258 14.0462 3.6274 5.9413 132.7050
temp: 298.150 k
press: 1.00000 atm
elementType: 8 8 8 7 7 7 6 6 6 6 6 6 6 6 6 6 6 6 6 6 6 6 6 6 1 1 1 1 1 1 1 1 1 1 1 1 1 1 1 1 1
symmnumber: 1
zpe: 842545.9 jmol-1
zpe.correction: 0.320909 hartree
zpe.thermalcorrener: 0.341690 hartree
zpe.thermalcorrenthalpy: 0.342634 hartree
zpe.thermalcorrgfe: 0.267137 hartree
zpe.sumelectzpe: -1083.706377 hartree
zpe.sumelectthermal: -1083.685596 hartree
zpe.sumelectthermalent: -1083.684651 hartree
zpe.sumelectthermalfe: -1083.760149 hartree
dipole: -25.0930 -5.4329 -0.4868
dipole: 25.6790
quadrupole: 75.2827 -104.5325 -115.2392
quadrupole: -47.6558 11.3243 8.1393
quadrupole: 123.4457 -56.3695 -67.0762 -47.6558 11.3243 8.1393
hfenergy: -1084.0272857 hartree
pointgroup: C01 [X(C18H17N3O3)]
dipole: 9.9045985 1.6626122 1.0969404 debye
polarizability: 588.955587|15.7714393|228.2084706|50.9571336|14.1086187|154.9217572 unknown
InChI: InChI=1S/C18H17N3O3/c1-19-8-4-14(5-9-19)15-6-10-20(11-7-15)13-16-12-17(21(23)24)2-3-18(16)22/h2-12,22H,13H2,1H3
charge 2 multiplicity 1
41 atoms
O  -2.35346 3.022027 0.501828
O  -6.011908 -1.420402 -2.294724
O  -4.863248 -2.672291 -0.763559
N  -0.462509 0.382437 1.423337
N  6.291299 -0.625809 -0.653119
N  -5.165597 -1.557574 -1.338053
C  -1.91747 0.601004 1.844943
C  -2.853901 0.680664 0.656924
C  2.201431 -0.011945 0.587323
C  0.082282 -0.877781 1.45312
C  0.277693 1.454523 0.982204
C  3.613248 -0.22197 0.1567
C  1.402215 -1.098257 1.039316
C  1.60418 1.279079 0.56545
C  -3.104501 1.934991 0.027379
C  -3.546011 -0.459344 0.199847
C  4.610063 0.77102 0.373745
C  4.019273 -1.424162 -0.484669
C  -4.462558 -0.333443 -0.860289
C  -4.047033 2.052608 -1.019723
C  5.930475 0.549548 -0.033254
C  5.352227 -1.603504 -0.879772
C  -4.734306 0.909854 -1.470004
C  7.719299 -0.823031 -1.073354
H  -1.933631 1.538434 2.424542
H  -2.181816 -0.237554 2.508282
H  -0.555079 -1.68534 1.819118
H  -0.243158 2.416356 0.957672
H  1.79896 -2.114081 1.113574
H  2.145508 2.156653 0.202498
H  -3.41769 -1.444357 0.661426
H  4.384453 1.709982 0.885727
H  3.308841 -2.222597 -0.713617
H  -4.244947 3.024808 -1.485132
H  6.722396 1.284807 0.127069
H  5.692015 -2.511675 -1.381546
H  -5.468339 0.96528 -2.278746
H  7.828107 -1.801015 -1.562562
H  8.005561 -0.029266 -1.781665
H  8.370578 -0.786424 -0.185363
H  -2.69774 3.89205 0.17783
