program: Gaussian 09
title: 000195677
version: EM64L-G09RevD.01
frameworkgroup: C1[X(C14H15FN2O2)]
method: RPBEPBE
basis: SDD
operation: Freq
keyword: #p
keyword: freq=noraman
keyword: PBEPBE/SDD
title: #p freq=noraman PBEPBE/SDD
converged: YES YES NO NO
title: Mulliken charges:
elementType: F O O N N C C C C C C C C C C C C C C H H H H H H H H H H H H H H H
charge: -0.232572 -0.270316 -0.256048 -0.193277 -0.381188 -0.138687 -0.504735 -0.363865 -0.046651 -0.156923 0.210749 0.144933 -0.610196 0.474974 -0.435399 -0.394397 -0.228907 -0.229503 -0.236882 0.283877 0.274735 0.248581 0.276815 0.244360 0.235446 0.264821 0.350774 0.233085 0.260689 0.246494 0.236616 0.230893 0.228864 0.232840
chargesum: 0.00000
title: Mulliken charges with hydrogens summed into heavy atoms:
elementType: F O O N N C C C C C C C C C C C C C C
charge: -0.232572 -0.270316 -0.256048 -0.193277 -0.030414 0.145190 0.018581 0.157310 0.188795 0.107898 0.210749 0.144933 -0.116423 0.474974 -0.188905 -0.157781 0.001986 -0.000639 -0.004042
polarizability: 2.08410158e+02 8.47939811e+00 1.49741295e+02 1.05079520e+01 -8.86881533e+00 1.25739950e+02
1716.lowfreq: -15.1914 -7.0307 0.0001 0.0003 0.0006 7.8742 23.5454 27.0732 43.5984
frequency: 22.5757 26.7469 43.5366 62.0627 90.2868 96.7615 124.8829 159.4788 193.3107 214.1256 223.5249 305.5851 339.4674 371.5856 396.0666 401.1920 404.6161 412.5695 457.5337 478.7467 492.9622 549.5727 594.7140 615.6005 617.6337 650.6184 682.7143 707.5064 726.2336 747.3804 764.2416 792.1269 796.7025 834.4631 857.7672 886.7008 901.8568 913.3940 928.0608 944.0163 975.4388 979.7957 989.6875 998.0457 1006.3526 1026.2184 1051.2628 1055.8424 1081.5840 1099.4152 1108.0847 1153.2145 1174.1512 1187.0516 1188.7159 1198.0980 1202.7006 1214.9611 1244.5484 1248.2617 1277.1573 1278.5653 1293.7984 1303.1101 1315.5021 1318.4086 1336.9491 1341.0415 1370.2155 1381.5184 1385.8574 1419.7887 1440.4191 1451.1570 1465.2215 1468.5332 1483.8257 1591.8435 1603.5012 1613.3781 1633.2550 2925.8147 2952.7350 3008.8701 3018.5113 3039.0163 3073.4694 3081.2331 3087.5134 3112.5275 3114.5950 3125.1314 3133.8987 3146.3923 3164.9923 3488.4078
redmass: 6.4450 4.2643 4.7007 4.4537 7.9457 5.0890 6.2429 5.7065 4.7641 5.9991 6.4749 4.8664 2.4825 2.9894 3.5351 3.2498 2.8531 3.5399 4.7586 7.5796 3.6814 5.3437 3.8830 4.1248 4.1416 4.2982 1.5819 1.9381 3.4558 2.2836 2.9784 4.4604 3.8408 3.6779 1.2510 2.3808 2.5577 1.9202 1.6413 2.5338 2.6857 1.4723 6.1269 1.3218 1.9482 2.2215 1.9241 2.5226 2.2530 1.8516 2.0876 1.4002 1.0553 3.2310 1.1557 1.3600 1.4732 2.4234 1.6300 1.3260 1.3927 1.3358 1.2822 1.4081 1.3729 1.5242 1.2974 1.6639 4.0610 6.9573 2.4665 3.1040 2.1259 1.0869 1.1210 1.0832 2.2620 5.9906 11.2663 6.1100 7.2054 1.0814 1.0826 1.0622 1.0612 1.0652 1.1010 1.1020 1.0909 1.0886 1.0877 1.1004 1.0896 1.0953 1.1013 1.0765
irintensity: 0.6864 0.4965 0.4823 1.1919 7.2918 3.9758 1.9431 1.3008 3.3517 0.4300 1.0247 15.6035 4.0869 18.0315 4.7869 5.2680 0.6632 5.0074 5.5966 3.3724 10.3372 1.2911 20.7519 4.1936 5.1291 9.0577 79.6848 33.6615 23.6832 31.9308 12.9163 21.9406 20.0750 6.1422 0.1950 1.9454 3.5625 3.1547 9.8809 21.0199 3.7347 0.1418 0.4025 0.8251 12.3430 6.4668 18.1604 2.1886 8.6917 19.1142 5.8063 4.4119 0.1100 22.3991 0.4439 5.1280 8.0322 4.8068 4.9076 43.6316 6.7523 13.1099 14.2230 31.6876 2.7575 5.1738 1.7173 12.0063 184.8614 4.1998 132.8988 11.3829 7.4043 17.9361 9.7416 10.7243 16.6710 2.5538 294.6543 16.8410 370.3595 22.2887 17.5313 16.3154 9.7656 4.7533 8.6789 8.4797 44.5267 8.0877 11.4622 6.1277 5.6020 33.3897 22.5245 70.0928
temp: 298.150 k
press: 1.00000 atm
elementType: 9 8 8 7 7 6 6 6 6 6 6 6 6 6 6 6 6 6 6 1 1 1 1 1 1 1 1 1 1 1 1 1 1 1
symmnumber: 1
zpe: 707343.0 jmol-1
zpe.correction: 0.269413 hartree
zpe.thermalcorrener: 0.285726 hartree
zpe.thermalcorrenthalpy: 0.286671 hartree
zpe.thermalcorrgfe: 0.223233 hartree
zpe.sumelectzpe: -900.930317 hartree
zpe.sumelectthermal: -900.914003 hartree
zpe.sumelectthermalent: -900.913059 hartree
zpe.sumelectthermalfe: -900.976497 hartree
dipole: 1.0746 -0.0011 -0.3782
dipole: 1.1393
quadrupole: -96.7029 -130.8785 -106.2709
quadrupole: 2.4614 10.9543 -4.0462
quadrupole: 14.5812 -19.5944 5.0132 2.4614 10.9543 -4.0462
hfenergy: -901.1997295 hartree
pointgroup: C01 [X(C14H15F1N2O2)]
dipole: -0.4198653 -0.0337457 -0.1532052 debye
polarizability: 208.4739391|7.605586|152.3266819|-10.5723324|4.1442965|123.0907818 unknown
InChI: InChI=1S/C14H15FN2O2/c15-10-7-12-13(18)16-11(14(19)17(12)8-10)6-9-4-2-1-3-5-9/h1-5,10-12,16H,6-8H2
charge 0 multiplicity 1
34 atoms
F  4.986512 0.443364 1.352226
O  1.070726 2.423342 -1.014895
O  1.169969 -2.837936 0.301001
N  2.229838 0.618413 -0.125297
N  -0.069318 -0.883267 -0.001159
C  2.284889 -0.670553 0.61647
C  3.659272 -1.244941 0.207502
C  3.574027 1.095089 -0.529475
C  4.519182 0.012828 0.017357
C  -0.222259 0.589079 0.030714
C  1.077659 1.299779 -0.422421
C  1.087844 -1.574331 0.286834
C  -1.41543 1.027551 -0.860382
C  -2.74166 0.469625 -0.365348
C  -3.362246 -0.628934 -1.015113
C  -3.372718 1.023233 0.780081
C  -4.579301 -1.164691 -0.531746
C  -4.586974 0.491824 1.265314
C  -5.193627 -0.607458 0.612028
H  2.274957 -0.47889 1.711068
H  4.081744 -1.920197 0.965298
H  3.569842 -1.80266 -0.741571
H  3.799209 2.085241 -0.097613
H  3.632524 1.182458 -1.630591
H  5.429686 -0.132291 -0.585608
H  -0.431584 0.922783 1.072482
H  -0.919403 -1.437916 -0.152159
H  -1.214129 0.702268 -1.897086
H  -1.41543 2.131281 -0.865734
H  -2.902696 -1.052814 -1.917599
H  -2.916138 1.88404 1.285421
H  -5.045919 -2.010343 -1.049079
H  -5.063513 0.935125 2.146859
H  -6.136835 -1.0195 0.987221
