program: Gaussian 09
title: 000195681
version: EM64L-G09RevD.01
frameworkgroup: C1[X(C12H18O9)]
method: RPBEPBE
basis: SDD
operation: Freq
keyword: #pfreq=noraman
keyword: PBEPBE/SDD
title: #p freq=noraman PBEPBE/SDD
converged: YES YES NO NO
title: Mulliken charges:
elementType: O O O O O O O O O C C C C C C C C C C C C H H H H H H H H H H H H H H H H H H
charge: -0.230220 -0.233962 -0.301710 -0.256949 -0.253944 -0.441622 -0.429748 -0.436876 -0.437054 -0.256435 -0.177183 -0.153466 -0.186139 -0.120140 -0.161240 -0.133383 -0.139911 -0.037418 -0.032460 -0.390668 -0.312550 0.294167 0.293205 0.273270 0.258197 0.276603 0.253384 0.240265 0.239492 0.258592 0.258096 0.234366 0.279949 0.233148 0.262079 0.366883 0.345270 0.379472 0.376642
chargesum: 0.00000
title: Mulliken charges with hydrogens summed into heavy atoms:
elementType: O O O O O O O O O C C C C C C C C C C C C
charge: -0.230220 -0.233962 -0.301710 -0.256949 -0.253944 -0.074739 -0.084478 -0.057404 -0.060413 0.037732 0.116022 0.119804 0.072058 0.156463 0.092144 0.106882 0.099580 0.221174 0.225635 0.123647 0.182677
polarizability: 1.83880320e+02 -6.44963146e+00 1.39541043e+02 1.92133288e+00 -8.39921749e-01 1.23502733e+02
1716.lowfreq: -20.1520 -6.2713 -0.0003 0.0004 0.0007 10.5883 42.7838 44.0808 47.6193
frequency: 42.7174 44.0560 47.5059 104.6850 116.5375 148.6718 156.1562 166.1559 210.5469 222.0970 225.4706 237.7950 264.6414 267.2514 273.0058 286.0066 351.9251 361.1849 373.2916 380.9769 401.9448 423.9277 426.7365 449.9946 461.5914 475.6384 503.9084 511.6374 540.1938 571.2020 575.0250 664.4393 720.6894 738.5353 760.9866 771.0051 772.7596 785.2595 797.3819 816.2384 842.1464 859.3773 887.5468 891.2025 909.0104 918.8730 926.8304 945.6270 949.0143 957.9362 965.3899 984.6861 987.0717 1007.8963 1016.3656 1041.6831 1043.0661 1046.2335 1055.6968 1059.1181 1064.8009 1093.8142 1111.2333 1145.8567 1160.6600 1178.1182 1183.5435 1196.2837 1199.1431 1227.4368 1245.0240 1248.9540 1252.7350 1262.7753 1267.8105 1273.6198 1279.3032 1303.4418 1307.6312 1307.7863 1314.2378 1321.8812 1331.1265 1334.2985 1343.2425 1344.6213 1348.5623 1370.7992 1383.7920 1385.6589 1394.3892 1457.3343 1472.4386 3010.0804 3011.2390 3016.3605 3044.4818 3047.3708 3059.2369 3062.4787 3085.2154 3094.3811 3097.5108 3098.1026 3100.8226 3101.4831 3121.2954 3514.6983 3520.6728 3537.3651 3566.5253
redmass: 6.2800 6.9130 5.3150 5.4866 6.8460 5.4380 6.4889 5.4842 6.1072 4.0618 4.8995 5.5010 2.6198 3.5559 4.1556 1.4619 3.3601 3.0208 4.0096 4.7882 1.4595 3.5014 3.0219 1.5891 3.4941 1.5688 5.9323 3.5849 7.6171 6.0593 6.4037 5.0311 5.2335 4.5799 4.4616 3.7838 3.9765 4.7905 4.8016 3.7479 3.8901 4.7958 3.7706 5.2468 3.6846 3.1091 2.9576 3.4266 4.6184 3.2404 2.8598 4.3209 4.3937 3.7443 3.2021 2.2445 2.2609 1.9161 1.6589 4.1934 3.1405 3.0071 2.6738 1.5682 1.5892 1.1793 1.3201 1.2593 1.3569 1.5028 1.4154 1.4178 1.4314 1.3175 1.3580 1.5714 1.2482 1.1813 1.3354 1.3577 1.3329 1.3179 1.2070 1.2225 1.3581 1.2904 1.3844 1.2392 1.2184 1.1955 1.4105 1.0881 1.0827 1.0641 1.0859 1.0606 1.0855 1.0860 1.0870 1.0875 1.0883 1.0900 1.1039 1.0924 1.0924 1.0994 1.0910 1.0650 1.0647 1.0657 1.0665
irintensity: 0.1964 0.8995 1.6604 2.2509 0.9989 2.0213 4.0448 4.9862 31.6099 16.3844 4.6646 6.1453 59.1724 28.2060 55.3314 48.7445 18.4819 0.3939 1.7352 27.5601 37.8754 22.7187 41.6548 142.4580 2.9107 277.3377 13.8101 46.5296 15.3406 1.5411 13.4392 4.2447 7.4294 9.0757 3.0116 5.4877 55.5247 14.0339 33.7554 1.0560 22.5387 310.9214 6.2563 241.8738 15.7420 78.6233 6.9540 9.4409 6.9169 95.2793 11.9758 321.4914 11.9837 36.1862 79.7464 42.4500 9.5041 21.4735 6.4781 51.8225 23.2429 6.1014 5.5030 0.4219 0.1822 12.9063 41.3603 24.8041 50.7014 20.9538 11.8887 2.2396 3.3241 18.6664 14.4544 6.8159 2.0975 11.4468 4.9692 4.3035 1.4657 2.8722 1.2833 3.7906 6.5323 1.3749 4.5115 47.2210 13.5398 33.9586 3.4846 11.8988 12.9185 52.5150 28.0904 37.3682 9.8098 4.7085 34.9987 22.0152 12.8616 19.3557 5.2708 7.5990 16.4696 11.2242 12.5500 30.0824 9.5914 12.5046 9.4081
temp: 298.150 k
press: 1.00000 atm
elementType: 8 8 8 8 8 8 8 8 8 6 6 6 6 6 6 6 6 6 6 6 6 1 1 1 1 1 1 1 1 1 1 1 1 1 1 1 1 1 1
symmnumber: 1
zpe: 807157.6 jmol-1
zpe.correction: 0.307430 hartree
zpe.thermalcorrener: 0.326178 hartree
zpe.thermalcorrenthalpy: 0.327122 hartree
zpe.thermalcorrgfe: 0.261565 hartree
zpe.sumelectzpe: -1143.347824 hartree
zpe.sumelectthermal: -1143.329076 hartree
zpe.sumelectthermalent: -1143.328132 hartree
zpe.sumelectthermalfe: -1143.393689 hartree
dipole: 2.1644 -0.0366 3.4444
dipole: 4.0681
quadrupole: -115.0222 -122.0256 -130.9637
quadrupole: -3.7468 14.3458 -1.5797
quadrupole: 7.6483 0.6449 -8.2932 -3.7468 14.3458 -1.5797
hfenergy: -1143.6552537 hartree
pointgroup: C01[X(C12H18O9)]
dipole: -0.8513473 -0.0143235 1.3552346 debye
polarizability: 183.6720933|-7.0656842|139.6806079|-2.1211665|1.3680364|123.5713941 unknown
InChI: InChI=1S/C12H18O9/c13-5-3-1-17-9(5)7(15)11(19-3)21-12-8(16)10-6(14)4(20-12)2-18-10/h3-16H,1-2H2
charge 0 multiplicity 1
39 atoms
O  1.90606 -0.266352 1.745193
O  -1.862433 0.301572 1.721132
O  0.029205 0.022134 0.237184
O  2.53344 -0.352147 -1.36911
O  -2.379217 0.4378 -1.357141
O  5.191169 -0.245173 -0.097296
O  -5.101112 0.269516 -0.1998
O  0.935305 2.19196 -0.95088
O  -0.885953 -2.108825 -1.020122
C  3.007373 0.854736 -0.618174
C  -2.943737 -0.761408 -0.676079
C  2.998072 -0.885471 0.941284
C  -2.951496 0.937143 0.925842
C  3.935857 0.256871 0.453509
C  -3.86882 -0.212423 0.418864
C  1.829459 1.610217 0.040097
C  -1.78607 -1.555287 -0.01869
C  1.057132 0.690361 1.039492
C  -1.015499 -0.654223 1.005135
C  2.51563 -1.496445 -0.386041
C  -2.483674 1.576461 -0.390367
H  3.511603 1.500404 -1.354317
H  -3.45859 -1.365625 -1.437891
H  3.482222 -1.598951 1.621649
H  -3.428198 1.639838 1.6257
H  4.208981 0.947453 1.26492
H  -4.065437 -0.946029 1.225163
H  2.235083 2.472707 0.597727
H  -2.192222 -2.432883 0.513429
H  0.570581 1.264494 1.846491
H  -0.545794 -1.245527 1.810156
H  3.217498 -2.270084 -0.748251
H  1.496662 -1.908586 -0.329676
H  -3.249254 2.278675 -0.767723
H  -1.501764 2.069551 -0.311363
H  5.016647 -0.600076 -1.008083
H  -5.738568 0.543734 0.506748
H  0.471406 1.436709 -1.402428
H  -0.485251 -1.336923 -1.502586
