program: Gaussian 09
title: 000195822
version: EM64L-G09RevD.01
frameworkgroup: C1[X(C25H27N3O4S)]
method: RPBEPBE
basis: SDD
operation: Freq
keyword: #p
keyword: freq=noraman
keyword: PBEPBE/SDD
title: #p freq=noraman PBEPBE/SDD
converged: YES YES NO NO
title: Mulliken charges:
elementType: S O O O O N N N C C C C C C C C C C C C C C C C C C C C C C C C C H H H H H H H H H H H H H H H H H H H H H H H H H H H
charge: 0.960277 -0.284789 -0.202377 -0.545731 -0.526055 -0.114534 -0.522362 -0.024001 0.380352 0.053292 -0.491527 -0.502765 -0.394041 -0.366844 -0.578844 -0.473614 -0.625012 -0.563384 0.298590 0.280256 0.089031 0.211289 0.195411 -0.381487 -0.541315 -0.359165 -0.455972 -0.400984 0.399986 0.316283 -0.316965 -0.267227 -0.734477 0.193026 0.217684 0.217312 0.225358 0.228821 0.205011 0.212591 0.194580 0.230679 0.254418 0.256795 0.212686 0.227735 0.240493 0.241006 0.226299 0.233533 0.241699 0.260624 0.258745 0.284100 0.258110 0.239715 0.286134 0.276940 0.285754 0.278855
chargesum: 0.00000
title: Mulliken charges with hydrogens summed into heavy atoms:
elementType: S O O O O N N N C C C C C C C C C C C C C C C C C C C C C C C C C
charge: 0.960277 -0.284789 -0.202377 -0.545731 -0.526055 -0.114534 -0.236229 -0.024001 0.380352 0.246319 -0.056531 -0.048586 0.023561 0.058415 -0.067630 -0.033194 -0.143513 -0.103552 0.298590 0.280256 0.089031 0.211289 0.195411 -0.139788 -0.280691 -0.100420 -0.171871 -0.142874 0.399986 0.316283 -0.077250 -0.267227 0.107072
polarizability: 5.66959898e+02 -1.92159775e+01 2.98000584e+02 2.46563230e+01 1.16496357e-01 2.44160850e+02
1716.lowfreq: -9.5603 -2.6065 -0.0008 0.0010 0.0018 3.5103 12.2548 15.4668 19.4771
frequency: 11.9399 14.3551 19.3794 21.9142 32.5416 41.8210 55.6113 67.4027 85.9957 105.0628 118.3946 131.6697 134.4313 136.0345 150.1078 156.1215 159.8096 160.9044 181.0912 205.3304 217.4865 237.0108 240.1435 265.8744 271.9852 283.3321 298.5480 310.7418 317.8186 343.6149 356.3340 373.4494 383.8844 393.1963 406.2552 412.1879 426.0796 430.3953 436.3350 442.5760 451.5765 467.2014 472.0705 497.9851 510.1988 514.3369 538.8927 547.8441 563.9864 575.9903 586.9215 604.3266 617.8684 635.4340 653.2855 702.6235 708.3130 718.3701 728.6749 746.1314 766.1828 780.4454 791.9878 803.6311 808.4960 832.8843 835.0898 848.3143 859.7985 875.5930 884.2412 896.2228 898.9966 914.2310 924.8172 931.8753 934.3722 942.3837 963.2668 970.7967 974.3256 978.3249 979.9409 1014.9911 1021.9925 1028.3079 1029.7381 1037.7954 1071.8453 1081.7504 1099.6372 1110.3229 1126.8435 1130.2957 1132.0061 1141.0899 1155.6639 1160.5850 1164.0193 1181.7834 1188.9501 1209.3792 1211.5527 1216.6300 1218.2981 1230.6447 1234.5880 1240.7666 1247.1252 1262.2661 1269.1680 1279.3675 1288.2231 1303.0456 1304.4455 1310.4649 1311.0580 1322.6789 1330.8111 1334.1396 1346.1309 1353.7200 1358.9311 1371.4593 1378.5841 1394.8558 1400.2924 1413.6972 1414.1707 1415.3204 1427.7726 1438.0537 1443.7647 1448.6706 1453.9320 1458.2742 1465.5996 1466.7481 1472.3816 1479.6119 1496.1560 1556.6777 1572.0418 1593.6882 1615.9621 1623.0270 2176.3110 2826.8611 2865.8114 2881.8794 2958.4820 2964.8144 2980.7726 2993.7768 3000.2646 3001.5215 3031.8278 3032.8148 3037.3133 3053.7279 3059.2965 3064.3393 3068.8826 3069.9411 3078.4513 3124.1822 3131.0448 3136.8994 3161.3444 3164.6317 3171.0355 3185.5128 3193.6259 3321.7402
redmass: 7.4404 5.0908 6.2039 4.6908 6.4875 7.5383 7.3795 6.2854 5.2626 5.0723 3.6562 4.8816 4.0100 4.0337 4.6805 1.8773 5.3295 2.0499 4.6682 3.0057 3.1102 3.7398 4.4041 2.9664 3.7572 3.5487 3.9747 3.5701 8.1507 3.3839 3.0149 5.0189 4.3908 2.9010 3.5265 3.8485 3.0304 3.5938 3.1511 3.9439 4.4553 3.8537 3.3370 3.3506 4.2635 4.6621 5.5295 3.7403 4.5340 6.5952 3.9121 4.6696 4.1017 3.0751 3.3489 5.4149 5.3764 2.8145 3.9945 4.3421 4.3390 2.6681 2.0578 10.4436 2.2600 1.5668 1.5424 2.6705 2.5000 2.0588 2.7943 1.4605 3.2184 2.3013 2.5158 1.9552 1.8102 1.7808 1.3856 2.0795 1.4131 1.2991 2.1173 1.6746 1.8202 2.5883 2.6228 2.5048 2.1621 2.0985 2.3807 2.6246 1.7003 3.1266 1.7157 1.3269 1.7317 2.2485 1.7691 1.8128 1.2708 1.6591 1.8070 1.5161 1.3258 1.9452 2.3392 2.2017 1.6440 1.5734 1.6067 1.5248 1.8550 1.4195 1.3422 1.1574 1.3032 1.6233 1.4426 1.3535 1.5802 1.6234 1.5196 2.7058 2.0173 1.4647 4.7331 3.7983 1.0515 1.0556 1.0939 1.1384 3.4161 1.1260 1.1428 1.0853 1.8853 1.3172 1.1069 1.1094 2.4641 7.3816 6.4623 8.8280 6.4983 8.2233 12.6314 1.0803 1.0714 1.0707 1.0633 1.0651 1.0651 1.0600 1.0639 1.0603 1.0936 1.0955 1.0248 1.1012 1.0918 1.1021 1.0940 1.0905 1.0953 1.0893 1.0900 1.0923 1.0920 1.0962 1.0954 1.1075 1.1074 1.0743
irintensity: 0.4943 2.0558 4.1626 1.3940 1.2079 1.0357 3.4843 1.4190 1.0146 2.1212 0.2186 5.2259 1.1887 3.3791 7.3607 6.4064 17.0117 1.0897 1.0998 7.2941 5.8952 10.2714 4.1858 3.3537 12.2413 7.6212 7.7828 1.3778 33.2443 4.3020 12.7603 14.8607 15.2047 1.2925 7.8508 17.2020 4.5108 1.9810 0.7231 1.3429 1.0870 0.4305 5.7591 3.1431 14.3586 1.5581 2.5865 40.1138 24.0225 40.1732 2.6893 3.0705 3.3592 8.7580 1.3865 0.9165 0.8132 4.3300 3.5160 2.5112 5.5031 5.0244 6.3143 66.6224 21.5553 39.3524 24.0678 99.4379 9.0898 82.4312 4.2960 0.3561 14.7560 28.6019 9.7215 19.9726 24.0278 6.8844 1.9084 59.9326 5.2562 57.2991 15.2759 4.4757 35.2102 6.3653 3.5087 15.4445 5.8138 1.5547 37.2408 1.0387 50.8418 10.7857 86.1782 1.0294 36.2391 16.5866 25.4481 49.9428 4.5921 11.6547 2.5386 7.7208 1.5698 180.2446 14.9959 81.9843 35.6922 39.2743 3.1603 17.9562 107.6987 0.8754 1.6004 10.6053 1.2551 39.1871 1.5184 6.1226 5.6221 20.8651 16.4132 4.4837 3.8816 8.6885 27.5628 5.2558 9.8442 11.3082 3.6615 29.2339 39.2490 8.2941 4.4646 26.5685 123.8160 47.3455 8.8042 14.3403 28.3365 33.0606 11.1339 246.7150 17.1127 214.4502 59.7645 60.2944 62.6479 79.0454 17.3942 21.3621 5.1361 15.2201 29.6826 21.0949 18.9914 29.4363 0.1924 29.9253 23.9575 28.4543 70.8744 6.9057 27.4946 11.9836 4.9898 4.2311 3.6125 5.9212 5.4483 0.2297 0.4037 11.3573
temp: 298.150 k
press: 1.00000 atm
elementType: 16 8 8 8 8 7 7 7 6 6 6 6 6 6 6 6 6 6 6 6 6 6 6 6 6 6 6 6 6 6 6 6 6 1 1 1 1 1 1 1 1 1 1 1 1 1 1 1 1 1 1 1 1 1 1 1 1 1 1 1
symmnumber: 1
zpe: 1242168.3 jmol-1
zpe.correction: 0.473117 hartree
zpe.thermalcorrener: 0.503965 hartree
zpe.thermalcorrenthalpy: 0.504909 hartree
zpe.thermalcorrgfe: 0.407836 hartree
zpe.sumelectzpe: -1829.493730 hartree
zpe.sumelectthermal: -1829.462882 hartree
zpe.sumelectthermalent: -1829.461937 hartree
zpe.sumelectthermalfe: -1829.559011 hartree
dipole: 0.8831 0.9298 1.4729
dipole: 1.9529
quadrupole: -308.5211 -200.5316 -204.0485
quadrupole: -30.0324 23.1078 -13.0120
quadrupole: -70.8207 37.1688 33.6519 -30.0324 23.1078 -13.0120
hfenergy: -1829.9668467 hartree
pointgroup: C01 [X(C25H27N3O4S1)]
dipole: 0.3698326 0.1115148 0.664175 debye
polarizability: 560.6995988|-49.9864577|298.2498796|12.7549504|16.8988418|250.1718545 unknown
InChI: InChI=1S/C25H27N3O4S/c1-33(30,31)27-20-5-7-24-22(14-20)23(29)15-25(32-24)8-10-28(11-9-25)21-6-4-18-12-17(16-26)2-3-19(18)13-21/h2-3,5,7,12,14,21,27H,4,6,8-11,13,15H2,1H3
charge 0 multiplicity 1
60 atoms
S  7.842877 -1.758172 -1.035844
O  1.664431 0.931757 -0.808593
O  4.189252 1.098333 2.540318
O  8.498792 -2.582114 -2.28631
O  7.658065 -0.138959 -1.083953
N  -1.741753 1.351378 0.275738
N  6.03652 -2.636078 -0.541692
N  -10.545264 -1.220601 -0.891333
C  1.216176 1.645775 0.459729
C  -3.106433 1.017125 -0.246504
C  0.296394 2.769776 -0.039736
C  0.410336 0.641668 1.313335
C  -0.998136 2.228289 -0.673715
C  -0.888636 0.181376 0.621229
C  2.460858 2.18876 1.191512
C  -4.043054 2.247319 -0.145747
C  -3.767489 -0.141458 0.535116
C  -5.376347 1.980721 -0.872877
C  -5.240357 -0.34628 0.190243
C  -6.01254 0.659839 -0.457094
C  3.494782 1.101329 1.48426
C  2.762106 0.086291 -0.711276
C  3.65964 0.095751 0.401799
C  -5.863491 -1.572157 0.541782
C  -7.378325 0.418645 -0.72825
C  2.977855 -0.806014 -1.7932
C  4.735386 -0.818473 0.429452
C  -7.221406 -1.81445 0.273624
C  -7.99429 -0.808267 -0.369952
C  4.954983 -1.723784 -0.636083
C  4.07155 -1.680293 -1.764471
C  -9.387527 -1.033345 -0.654446
C  8.822476 -2.190976 0.53578
H  -3.042452 0.71272 -1.325749
H  0.84263 3.388884 -0.775284
H  0.036811 3.408813 0.825226
H  0.147776 1.14526 2.263385
H  1.030309 -0.239555 1.564684
H  -1.632738 3.084044 -0.957306
H  -0.746029 1.67522 -1.612346
H  -0.632277 -0.424686 -0.284405
H  -1.428896 -0.474613 1.32191
H  2.172254 2.675455 2.138732
H  2.949234 2.955854 0.554987
H  -3.57081 3.146217 -0.578489
H  -4.219088 2.458678 0.926509
H  -3.676006 0.080171 1.619696
H  -3.235703 -1.094559 0.359147
H  -5.199759 1.966077 -1.968784
H  -6.083355 2.811219 -0.68742
H  -5.268223 -2.349459 1.036074
H  -7.976978 1.191936 -1.223259
H  2.285824 -0.785908 -2.639854
H  5.402159 -0.808162 1.297592
H  -7.688007 -2.764218 0.552065
H  4.250239 -2.351991 -2.613314
H  6.011036 -3.343172 -1.307373
H  8.808101 -3.285481 0.617356
H  9.833508 -1.789984 0.378482
H  8.298512 -1.702969 1.367598
