program: Gaussian 09
title: 000195586
version: EM64L-G09RevD.01
frameworkgroup: C1[X(C9H16O4)]
method: RPBEPBE
basis: SDD
operation: Freq
keyword: #pfreq=noraman
keyword: PBEPBE/SDD
title: #p freq=noraman PBEPBE/SDD
converged: YES YES NO NO
title: Mulliken charges:
elementType: O O O O C C C C C C C C C H H H H H H H H H H H H H H H H
charge: -0.258908 -0.446900 -0.304864 -0.431184 -0.183698 -0.167679 -0.072453 -0.072926 -0.516709 -0.376321 -0.034587 -0.500964 -0.593018 0.281399 0.219787 0.267635 0.256913 0.217435 0.224535 0.242422 0.196491 0.360472 0.222065 0.213562 0.240345 0.232753 0.342412 0.219202 0.222782
chargesum: 0.00000
title: Mulliken charges with hydrogens summed into heavy atoms:
elementType: O O O O C C C C C C C C C
charge: -0.258908 -0.086429 -0.304864 -0.088771 0.097701 0.052108 0.195182 0.183988 -0.074739 0.062591 0.187478 0.185697 -0.151034
polarizability: 1.20998063e+02 1.65695667e-01 1.04454439e+02 9.72814271e+00 2.99754571e+00 9.79434381e+01
1716.lowfreq: -18.4132 -12.4378 -0.0010 -0.0009 -0.0005 6.8184 54.2619 59.1978 59.8866
frequency: 54.2135 59.0231 59.8038 90.9684 94.4292 127.3475 145.8387 159.6658 195.6568 207.0290 248.5535 285.3087 313.8299 327.4368 366.5767 384.3957 410.1861 450.2343 517.6193 548.7657 600.2667 634.9012 699.3207 758.7078 826.7261 842.9542 877.2657 897.5005 919.5127 939.5012 950.6891 954.5830 970.6041 1000.9724 1004.8300 1015.6488 1038.0627 1062.9463 1068.6564 1095.2536 1114.7664 1120.4957 1148.7872 1153.5920 1182.5119 1219.6235 1236.6038 1248.8414 1266.6322 1279.2085 1292.1574 1303.6834 1308.4952 1322.9812 1335.3941 1360.0454 1374.0986 1398.4043 1427.6620 1430.3269 1456.3807 1461.0393 1471.1943 1480.0107 1658.1448 2966.1369 2967.7008 2970.7974 3031.0708 3035.6629 3039.2410 3043.4025 3057.5535 3063.1740 3077.7959 3093.0994 3097.3641 3121.6090 3196.7472 3424.8268 3555.8240
redmass: 5.1941 3.1728 3.2027 3.1871 3.1969 1.7018 2.6976 1.7070 2.8547 2.7313 3.8095 2.6891 2.8952 1.8869 3.3616 2.7258 3.4162 2.8859 3.1585 4.9346 1.1019 1.6919 5.0146 3.9391 2.3549 3.2794 4.2380 2.3435 2.8294 2.4304 1.3994 2.2022 5.3499 1.7196 1.8990 3.4065 2.7402 2.7127 1.8905 1.9234 1.4713 1.4731 1.4583 1.1908 1.6709 1.4551 1.2557 1.2962 1.3158 1.2892 1.2751 1.2620 1.3032 1.3734 1.3628 1.4425 1.2737 1.1730 1.1785 1.1444 1.0512 1.0966 1.0845 1.0522 4.6939 1.0335 1.0663 1.0660 1.0853 1.0868 1.0881 1.0924 1.0887 1.1009 1.0768 1.0776 1.0958 1.1021 1.1145 1.0655 1.0664
irintensity: 0.4482 0.5683 0.4334 6.4728 0.9433 2.7850 1.1021 4.6772 2.2661 5.4050 18.6186 13.3927 76.6755 65.8238 5.7509 1.2098 3.5272 1.4923 2.4958 2.9833 126.2473 25.6026 5.5384 5.6149 49.2732 70.6150 3.3875 9.7778 5.8000 21.0207 71.4435 122.6577 109.2810 92.8104 31.7178 40.9756 76.5645 20.5467 2.7552 3.7276 6.7169 7.8100 12.0320 45.2366 19.5672 1.5095 24.8064 1.1286 5.3129 2.2860 2.3572 2.1272 15.0574 4.2254 11.3702 4.6721 13.8955 52.6930 5.2333 9.4621 11.9377 17.6547 1.1986 14.3933 17.0319 68.5765 33.0334 38.1523 32.1994 30.6925 26.4162 15.7821 8.5190 37.0122 33.1197 6.7167 18.2552 21.0546 26.8942 67.3277 8.5216
temp: 298.150 k
press: 1.00000 atm
elementType: 8 8 8 8 6 6 6 6 6 6 6 6 6 1 1 1 1 1 1 1 1 1 1 1 1 1 1 1 1
symmnumber: 1
zpe: 634014.1 jmol-1
zpe.correction: 0.241483 hartree
zpe.thermalcorrener: 0.256194 hartree
zpe.thermalcorrenthalpy: 0.257138 hartree
zpe.thermalcorrgfe: 0.199491 hartree
zpe.sumelectzpe: -652.335398 hartree
zpe.sumelectthermal: -652.320688 hartree
zpe.sumelectthermalent: -652.319744 hartree
zpe.sumelectthermalfe: -652.377390 hartree
dipole: -3.0678 0.5346 -0.3683
dipole: 3.1357
quadrupole: -86.4664 -72.9821 -83.4668
quadrupole: 1.3244 1.8944 -6.6017
quadrupole: -5.4946 7.9897 -2.4950 1.3244 1.8944 -6.6017
hfenergy: -652.5768815 hartree
pointgroup: C01 [X(C9H16O4)]
dipole: -1.2065463 -0.2336468 0.1078183 debye
polarizability: 119.4110713|5.9961779|98.736279|-9.2833257|3.3231145|105.2485906 unknown
InChI: InChI=1S/C9H16O4/c1-3-4-6-8(11)7(5-10)13-9(6)12-2/h3,6-11H,1,4-5H2,2H3
charge 0 multiplicity 1
29 atoms
O  0.50862 -1.153809 0.588271
O  1.189553 0.5199 -2.24232
O  -0.564804 -1.621099 -1.535339
O  3.524606 1.017079 1.074204
C  -0.659956 0.576684 -0.563369
C  0.859547 0.794103 -0.842721
C  1.57391 -0.198495 0.129046
C  -0.67203 -0.926948 -0.244401
C  -1.228261 1.418853 0.611214
C  2.215887 0.424711 1.380617
C  -2.734744 1.298239 0.726273
C  -0.505958 -3.087215 -1.404144
C  -3.403142 0.857433 1.821508
H  -1.233817 0.783139 -1.483623
H  1.171117 1.840585 -0.676664
H  2.346237 -0.760525 -0.428192
H  -1.537989 -1.304348 0.329275
H  -0.959719 2.480907 0.433114
H  -0.756482 1.116016 1.564377
H  2.428845 -0.36924 2.11328
H  1.536101 1.166324 1.849604
H  0.754987 -0.352685 -2.462298
H  -3.306553 1.59556 -0.167436
H  -1.433303 -3.46882 -0.932636
H  0.367815 -3.392012 -0.800408
H  -0.420915 -3.481023 -2.428249
H  3.418926 1.718092 0.381672
H  -4.497171 0.798309 1.841627
H  -2.874404 0.549884 2.732615
