program: Gaussian 09
title: 000195614
version: EM64L-G09RevD.01
frameworkgroup: C1[X(C14H17N5O4)]
method: RPBEPBE
basis: SDD
operation: Freq
keyword: #p
keyword: freq=noraman
keyword: PBEPBE/SDD
title: #p freq=noraman PBEPBE/SDD
converged: YES YES NO NO
title: Mulliken charges:
elementType: O O O O N N N N N C C C C C C C C C C C C C C H H H H H H H H H H H H H H H H H
charge: -0.268986 -0.458477 -0.448013 -0.220934 -0.206945 -0.147519 -0.256890 -0.012282 -0.154399 -0.099343 -0.531332 -0.091209 -0.016015 0.342173 -0.433013 -0.187769 -0.273334 0.228694 0.176300 -0.662172 -0.315949 0.231550 -0.786201 0.260808 0.255237 0.277371 0.246861 0.241978 0.231347 0.232229 0.327958 0.356428 0.230741 0.280363 0.296161 0.295999 0.356066 0.237596 0.228111 0.236813
chargesum: 0.00000
title: Mulliken charges with hydrogens summed into heavy atoms:
elementType: O O O O N N N N N C C C C C C C C C C C C C C
charge: -0.268986 -0.102049 -0.091947 -0.220934 -0.206945 -0.147519 -0.256890 -0.012282 -0.154399 0.161464 0.001275 0.155652 0.225963 0.342173 0.030563 -0.187769 0.054625 0.228694 0.176300 0.145093 -0.019950 0.231550 -0.083680
polarizability: 2.83316391e+02 -1.33955116e+01 1.96021109e+02 1.61841844e+01 1.48440366e+01 1.29568482e+02
1716.lowfreq: -5.7825 -4.6860 -0.0008 -0.0006 -0.0002 3.0324 23.0077 33.1887 57.3813
frequency: 22.9357 32.8600 57.3619 64.7933 81.1654 104.9504 112.6025 116.3168 126.8824 157.2925 172.3183 208.4652 217.8900 227.0779 236.2057 238.6139 262.6109 311.5146 313.3348 320.7986 328.7446 362.6995 374.9204 389.3641 396.0580 417.7684 438.2837 481.5356 485.1715 510.9708 541.2907 605.7211 619.0030 624.8570 647.9502 661.3515 678.9604 679.2449 720.9296 743.9142 768.6122 771.8935 791.1332 809.1426 824.7485 874.6059 896.7476 925.8235 948.0267 955.8237 958.9467 970.1595 986.4634 992.0132 1026.8873 1040.6716 1043.4680 1048.4167 1074.6823 1113.3054 1121.6502 1126.7632 1132.4995 1140.2640 1164.2292 1192.6774 1212.1085 1222.3079 1239.0339 1262.2393 1274.9487 1275.9499 1296.9289 1300.3095 1306.8057 1317.0140 1317.4636 1334.8075 1342.7727 1345.9947 1371.6342 1374.1552 1381.6731 1402.8785 1425.4658 1444.1065 1458.3453 1467.1655 1470.0390 1475.6484 1477.2277 1489.6126 1496.7104 1536.4125 1563.9659 1581.7045 1661.0127 2972.2390 2985.5594 2986.6608 3003.8116 3010.9536 3053.0224 3064.7387 3083.4431 3094.2519 3098.0352 3110.3034 3117.2662 3120.2962 3223.8632 3264.8992 3556.9544 3583.3132
redmass: 5.3005 5.7562 4.6101 4.4436 5.9593 5.0412 1.0599 4.2257 5.3953 4.4398 5.0715 3.4839 4.5162 3.2936 1.2148 1.1604 4.1972 3.5042 3.5663 6.0802 5.2354 4.1392 3.6579 4.0278 4.3406 6.6378 1.1462 4.8800 4.4469 5.3664 6.4880 4.8496 4.3378 4.7297 5.0374 6.1249 7.7233 5.0401 6.7590 6.7982 5.6415 1.5304 5.5539 1.4748 2.1290 3.6695 2.7214 4.3929 4.8599 5.2984 3.8734 4.4244 3.0779 1.5778 3.5915 2.8332 1.8973 1.4956 3.4724 2.0075 2.5480 1.3136 1.9641 1.8316 1.8788 1.7832 1.2975 1.8327 2.9223 1.4106 1.3139 3.6365 3.1232 1.3591 1.2953 3.2593 1.5140 3.5325 1.3096 6.2027 1.4287 1.3963 1.4954 1.2687 1.3506 4.7660 1.0449 1.1474 1.1365 1.0840 1.5274 2.0049 1.1049 4.7185 5.8062 6.5502 12.2967 1.0842 1.0371 1.0359 1.0867 1.0615 1.0634 1.0978 1.0999 1.1050 1.0990 1.0919 1.1023 1.0993 1.1014 1.1001 1.0658 1.0670
irintensity: 0.2299 2.6246 1.7754 0.4065 1.0533 19.0299 0.1097 1.7362 1.6444 4.4210 8.8858 5.4010 7.3982 35.3476 139.2012 1.7057 3.8817 0.7923 0.8401 1.1616 1.6707 11.0608 12.1685 2.8597 3.7431 5.8438 170.9720 34.2787 4.3847 3.9151 9.5655 24.2632 1.1131 12.5150 15.2888 2.9873 6.2311 4.2639 37.1474 24.2214 7.4249 24.5598 33.7024 18.9233 7.1697 99.8764 46.6330 2.0577 19.5945 34.4304 54.1167 119.3754 22.5852 13.0761 13.1942 30.3852 22.7924 6.6385 18.4173 39.6678 41.0564 3.8705 7.3638 4.2428 19.7051 9.3832 95.5646 128.0177 43.9480 3.6540 0.2750 40.4056 35.4801 10.6817 13.1720 7.1405 3.5505 72.9391 11.1902 58.8615 10.8640 0.6618 0.7880 16.2274 4.9312 7.4934 14.4440 22.9408 14.5602 5.5803 44.6523 9.7482 17.9458 115.1589 269.2433 138.2459 477.4408 18.8076 39.4720 44.0530 43.5135 32.7936 12.8121 18.8800 9.7521 23.5431 18.2083 9.6500 2.9236 12.3134 30.5324 5.6583 16.9797 15.5665
temp: 298.150 k
press: 1.00000 atm
elementType: 8 8 8 8 7 7 7 7 7 6 6 6 6 6 6 6 6 6 6 6 6 6 6 1 1 1 1 1 1 1 1 1 1 1 1 1 1 1 1 1
symmnumber: 1
zpe: 814958.6 jmol-1
zpe.correction: 0.310401 hartree
zpe.thermalcorrener: 0.331431 hartree
zpe.thermalcorrenthalpy: 0.332375 hartree
zpe.thermalcorrgfe: 0.260091 hartree
zpe.sumelectzpe: -1116.617900 hartree
zpe.sumelectthermal: -1116.596870 hartree
zpe.sumelectthermalent: -1116.595926 hartree
zpe.sumelectthermalfe: -1116.668211 hartree
dipole: -5.7441 -6.2149 -0.9008
dipole: 8.5106
quadrupole: -126.7653 -157.3691 -122.6240
quadrupole: -5.9889 -4.3824 -1.0707
quadrupole: 8.8208 -21.7829 12.9621 -5.9889 -4.3824 -1.0707
hfenergy: -1116.9283017 hartree
pointgroup: C01 [X(C14H17N5O4)]
dipole: 2.3423429 2.3925049 -0.0279422 debye
polarizability: 280.9127758|-13.3843435|199.861208|-24.1246573|-1.9093809|128.1319977 unknown
InChI: InChI=1S/C14H17N5O4/c1-7-4-18-13(22)11-12(17(2)14(18)16-7)19(6-15-11)10-3-8(21)9(5-20)23-10/h4,6,8-10,20-21H,3,5H2,1-2H3
charge 0 multiplicity 1
40 atoms
O  2.442649 1.420809 -0.055624
O  4.466727 -1.46577 -0.774971
O  5.58301 0.4417 1.731191
O  -2.846795 -2.782015 0.281471
N  0.942935 -0.276884 -0.963657
N  -1.142272 1.04244 -0.441562
N  -2.99991 -0.433673 0.139925
N  0.121805 -2.376415 -0.535415
N  -3.398878 1.817048 0.116861
C  1.927262 0.773882 -1.283245
C  3.193509 0.243723 -1.992976
C  4.219396 -0.024127 -0.860609
C  3.538652 0.539073 0.425985
C  -0.398571 -0.116082 -0.586633
C  4.48494 1.342791 1.318003
C  -0.898175 -1.424846 -0.345397
C  1.199468 -1.679494 -0.888107
C  -2.482613 0.857224 -0.077117
C  -2.27347 -1.689502 0.042417
C  -0.656435 2.433964 -0.574264
C  -4.351833 -0.25262 0.498546
C  -4.581321 1.12234 0.482262
C  -5.847718 1.866615 0.784509
H  1.42332 1.569057 -1.848066
H  3.561255 1.032997 -2.667239
H  3.024036 -0.662837 -2.59329
H  5.171116 0.508469 -1.051403
H  3.101581 -0.311937 0.990946
H  3.954733 1.77354 2.188307
H  4.960517 2.158664 0.749352
H  2.190506 -2.088352 -1.073892
H  5.164436 -1.61543 -0.086612
H  -0.547668 2.721712 -1.635783
H  0.300171 2.557569 -0.040975
H  -1.424371 3.080902 -0.123135
H  -4.986216 -1.104113 0.72075
H  5.333541 -0.01903 2.570524
H  -6.169633 2.466588 -0.086226
H  -6.6617 1.170901 1.048041
H  -5.701384 2.567417 1.626709
