program: Gaussian 09
title: 000195585
version: EM64L-G09RevD.01
frameworkgroup: C1[X(C15H15FN2O4)]
method: RPBEPBE
basis: SDD
operation: Freq
keyword: #p
keyword: freq=noraman
keyword: PBEPBE/SDD
title: #p freq=noraman PBEPBE/SDD
converged: YES YES NO NO
title: Mulliken charges:
elementType: F O O O O N N C C C C C C C C C C C C C C C H H H H H H H H H H H H H H H
charge: -0.178748 -0.232556 -0.224942 -0.381606 -0.288949 -0.160914 -0.601976 -0.180088 -0.514286 -0.481574 0.317958 -0.312049 0.174995 0.099148 -0.426133 0.078577 -0.546756 0.181173 0.195997 0.102574 -0.229274 -0.433745 0.282859 0.257798 0.255799 0.254956 0.255784 0.301058 0.288201 0.312684 0.205157 0.224255 0.229652 0.225600 0.377011 0.279581 0.292781
chargesum: 0.00000
title: Mulliken charges with hydrogens summed into heavy atoms:
elementType: F O O O O N N C C C C C C C C C C C C C C C
charge: -0.178748 -0.232556 -0.224942 -0.004595 -0.288949 -0.160914 -0.029615 0.102771 -0.000689 0.029165 0.317958 -0.010991 0.174995 0.099148 -0.137933 0.078577 -0.234072 0.181173 0.195997 0.102574 0.200138 0.021508
polarizability: 3.02772107e+02 -6.94763135e+00 2.13175161e+02 -9.28924339e-01 -4.43729143e+00 9.85009906e+01
1716.lowfreq: -6.7321 -4.0426 -0.0010 -0.0008 0.0002 2.4215 23.0998 34.0506 47.0334
frequency: 23.0801 34.0462 47.0237 58.0140 65.2332 80.9101 83.7622 102.2551 111.3162 140.4071 152.3839 157.0941 172.9935 220.2482 224.6893 240.0495 264.4960 274.8910 321.8887 344.7772 364.0275 370.9850 379.1403 421.0491 445.0391 450.1758 484.8003 530.7441 539.8503 544.1983 577.8609 598.2388 609.2433 635.4249 653.0720 702.6418 706.8390 729.2858 735.8654 771.7221 794.0044 798.1514 801.2986 830.9754 840.4253 846.0999 890.1906 925.8819 944.1607 951.5394 965.6347 970.5218 1011.3718 1046.6566 1061.1681 1063.0837 1076.2594 1085.3263 1109.1452 1116.5538 1125.6502 1147.4131 1154.7548 1170.4806 1171.9476 1206.7332 1237.4530 1261.7309 1265.2985 1283.7312 1308.1198 1321.8361 1336.0897 1356.8001 1361.7375 1378.9164 1387.9761 1407.6486 1438.6327 1447.5750 1463.1811 1465.9140 1479.2253 1493.6511 1554.9694 1555.2744 1588.0799 1624.9998 1627.7087 1644.8042 2962.3278 2967.1166 3035.1967 3070.0733 3102.6175 3105.8655 3116.6290 3165.7096 3170.7457 3193.7625 3205.8475 3222.7857 3492.9074 3515.8923 3644.3401
redmass: 5.6122 9.9703 8.7330 4.2385 4.0575 3.3249 2.2664 2.1878 1.4211 4.4486 4.4487 3.0242 6.0370 5.6593 5.7862 6.0461 8.0773 5.1530 8.2100 5.8910 6.5380 4.9612 7.9421 4.9032 3.4904 6.7148 3.6552 1.5421 3.3582 4.2309 5.5637 1.5620 6.9255 4.2001 3.6125 4.8850 4.9307 3.5064 5.3392 2.0383 2.0163 1.9122 1.6670 1.4207 4.0958 1.7613 4.6564 1.4413 3.2523 3.2497 1.4380 1.5230 3.3149 3.2200 1.3853 2.4175 3.2140 1.2516 1.2736 2.9052 1.6510 1.2476 4.1435 1.5338 1.8044 2.2564 1.4148 2.0903 1.6814 2.1595 1.1086 1.6732 1.9569 3.9538 1.9535 3.4587 1.4871 8.6411 1.0993 8.0671 1.1529 1.2985 1.1246 2.9758 11.0463 7.8395 8.0582 7.6597 8.3219 1.0941 1.0614 1.0626 1.1027 1.1010 1.0665 1.0688 1.0682 1.0920 1.0923 1.0902 1.1175 1.1152 1.0635 1.0456 1.0998
irintensity: 0.4249 3.0342 0.0779 0.1953 0.1165 0.3764 2.8159 7.6889 20.8255 1.2403 0.7323 9.7393 4.6311 1.1288 2.3910 1.4863 5.6668 2.0221 1.7425 2.4886 2.2153 11.2235 1.2093 11.4545 3.8513 4.3707 15.2140 186.8391 70.6742 53.5172 27.4097 91.9552 3.3364 26.9282 28.3701 11.7462 11.7770 20.0804 5.1442 33.9291 0.3048 36.1005 23.5885 16.7184 13.6528 19.2852 24.5281 22.7209 4.5085 46.6971 14.7926 34.2786 61.3423 298.6889 25.8772 63.8663 3.5445 7.2633 9.4833 56.5357 51.9257 3.4212 135.4223 2.7166 10.7066 16.9758 26.9932 181.2481 72.4715 195.5923 0.1827 28.3269 13.0857 4.5632 16.1951 28.4515 7.6581 9.4403 13.5096 12.4015 105.5748 13.6703 67.0102 384.1988 149.3090 44.3430 349.4160 97.1044 323.7713 36.9495 10.8634 63.6381 17.1594 45.6595 8.1416 12.1497 4.9541 9.5195 3.5474 4.2199 0.7512 15.4153 34.1905 3.0555 7.6494
temp: 298.150 k
press: 1.00000 atm
elementType: 9 8 8 8 8 7 7 6 6 6 6 6 6 6 6 6 6 6 6 6 6 6 1 1 1 1 1 1 1 1 1 1 1 1 1 1 1
symmnumber: 1
zpe: 734138.4 jmol-1
zpe.correction: 0.279619 hartree
zpe.thermalcorrener: 0.300599 hartree
zpe.thermalcorrenthalpy: 0.301543 hartree
zpe.thermalcorrgfe: 0.228091 hartree
zpe.sumelectzpe: -1089.194582 hartree
zpe.sumelectthermal: -1089.173601 hartree
zpe.sumelectthermalent: -1089.172657 hartree
zpe.sumelectthermalfe: -1089.246109 hartree
dipole: -6.7766 7.5866 -0.2053
dipole: 10.1745
quadrupole: -114.2971 -134.0883 -124.9780
quadrupole: -6.6243 -0.2131 2.0325
quadrupole: 10.1574 -9.6339 -0.5235 -6.6243 -0.2131 2.0325
hfenergy: -1089.4742002 hartree
pointgroup: C01 [X(C15H15F1N2O4)]
dipole: -2.6160693 -3.0294625 -0.0475633 debye
polarizability: 301.7788561|8.7467564|213.3877723|12.2132008|-4.5656071|99.2816294 unknown
InChI: InChI=1S/C15H15FN2O4/c16-11-5-9-12(6-13(11)22-4-3-17)18(8-1-2-8)7-10(14(9)19)15(20)21/h5-8,20H,1-4,17H2
charge 0 multiplicity 1
37 atoms
F  -2.302282 3.330844 -0.417394
O  -3.498535 0.911541 -0.230205
O  2.702581 2.585755 -0.106278
O  5.125387 1.278454 0.337463
O  5.076663 -1.029782 0.466725
N  0.95313 -1.215668 0.187287
N  -6.432799 -1.380258 -0.164308
C  0.362957 -2.545987 0.343463
C  1.052071 -3.761081 -0.277349
C  -0.272512 -3.253908 -0.863053
C  0.116969 -0.075683 0.031889
C  2.31242 -1.052683 0.292928
C  0.728614 1.208366 -0.059268
C  2.976042 0.170019 0.211293
C  -1.296123 -0.216285 -0.02158
C  2.210521 1.417767 0.006998
C  -0.105993 2.346526 -0.2140
C  -2.11336 0.923526 -0.168937
C  -1.484688 2.20224 -0.266735
C  4.450574 0.063331 0.345497
C  -4.188743 -0.393074 -0.132301
C  -5.696828 -0.10679 -0.208757
H  -0.121965 -2.689104 1.316478
H  1.952976 -3.599375 -0.875712
H  1.054752 -4.686482 0.303784
H  -1.1843 -3.833786 -0.693927
H  -0.224037 -2.73946 -1.827022
H  2.903187 -1.95854 0.453247
H  -1.747147 -1.206538 0.048266
H  0.371242 3.328842 -0.287093
H  -3.871034 -1.047108 -0.970339
H  -3.943678 -0.887587 0.82765
H  -5.980985 0.515922 0.657655
H  -5.901081 0.498225 -1.116825
H  6.098945 1.084446 0.43345
H  -6.603923 -1.830813 -1.064224
H  -7.233921 -1.415009 0.465137
