program: Gaussian 09
title: 000195573
version: EM64L-G09RevD.01
frameworkgroup: C1[X(C19H21F3O2)]
method: RPBEPBE
basis: SDD
operation: Freq
keyword: #p
keyword: freq=noraman
keyword: PBEPBE/SDD
title: #p freq=noraman PBEPBE/SDD
converged: YES YES NO NO
title: Mulliken charges:
elementType: F F F O O C C C C C C C C C C C C C C C C C C C H H H H H H H H H H H H H H H H H H H H H
charge: -0.147533 -0.148069 -0.145841 -0.434829 -0.437485 -0.032394 0.437061 -0.149581 -0.599217 -0.521861 -0.484953 -0.505848 0.263034 -0.262103 -0.573594 -0.794182 0.301607 -0.348631 -0.535394 0.196902 -0.446138 0.287240 -0.147435 0.266641 0.229509 0.196882 0.197952 0.252398 0.228562 0.196473 0.200104 0.228822 0.215299 0.213673 0.248629 0.227882 0.224741 0.225640 0.252044 0.222506 0.218768 0.256272 0.354757 0.218812 0.352876
chargesum: 0.00000
title: Mulliken charges with hydrogens summed into heavy atoms:
elementType: F F F O O C C C C C C C C C C C C C C C C C C C
charge: -0.147533 -0.148069 -0.145841 -0.080072 -0.084608 0.197115 0.437061 0.047301 -0.148867 -0.096825 -0.056028 -0.076877 0.263034 -0.013474 -0.120972 -0.093992 0.301607 -0.129863 -0.279122 0.196902 -0.227326 0.287240 -0.147435 0.266641
polarizability: 2.93449640e+02 9.99960277e-01 2.09566909e+02 -6.85430756e+00 3.91268003e+00 1.34353673e+02
1716.lowfreq: -11.3302 -4.2365 -0.5604 -0.0009 -0.0007 -0.0005 6.1162 24.2553 28.1680
frequency: -11.0826 24.2346 28.1254 36.6386 65.5666 92.1467 103.9354 111.0243 143.5105 170.0065 181.6859 195.6843 209.6441 215.3000 236.2108 246.2109 269.1083 274.6850 295.8204 324.4456 331.2691 342.5964 369.1172 378.6983 384.4787 386.7424 406.2753 413.9319 426.9507 444.5555 456.2124 479.2167 486.0888 512.5529 543.0678 552.8145 559.7675 577.5704 589.5533 622.7365 643.0838 707.3792 715.1112 723.7913 740.9708 764.3986 799.6128 820.1979 849.8904 868.9038 880.6657 897.9460 904.0416 925.0180 928.6883 933.1159 952.4230 966.7233 981.9340 983.0545 993.6811 1013.2080 1019.8938 1028.6307 1063.5888 1085.4407 1103.3147 1113.9133 1124.8794 1128.6572 1144.2163 1156.6233 1174.0393 1178.6518 1188.3288 1191.7780 1216.5488 1229.8613 1248.5417 1251.4109 1259.7607 1267.1531 1276.4788 1283.9655 1287.0126 1294.7069 1310.4887 1324.0231 1326.3934 1332.8994 1340.8388 1346.3440 1357.1258 1364.2642 1383.5766 1391.2403 1442.8254 1454.3018 1457.3918 1459.4541 1468.6369 1472.1494 1481.6580 1487.9773 1495.5066 1587.0253 1631.8067 2282.2673 2898.4140 2927.8934 2941.3546 2950.5593 2958.1291 2959.5899 2972.4287 2987.8460 2991.3036 3021.8460 3025.1073 3033.6710 3045.4782 3047.2774 3081.3444 3101.4337 3110.3479 3141.2035 3145.8272 3558.9829 3582.4282
redmass: 15.9938 7.7972 5.5225 4.7059 4.4152 9.0239 4.3740 5.4631 8.8244 2.1794 4.8027 4.4165 1.4996 4.4144 1.7484 3.4130 1.1420 3.0202 3.2528 4.0588 2.9791 1.1229 3.9207 2.6111 8.0059 3.7688 7.3046 4.7673 3.3471 2.7909 3.6936 4.0578 2.7049 4.9952 7.2102 3.8898 12.2681 4.8885 10.2070 3.0487 3.2194 4.0690 7.3875 4.0130 3.0131 2.3096 1.5458 2.2584 1.8490 2.5009 1.7160 1.6811 3.4306 1.4998 2.0457 2.9884 2.5857 2.0544 12.1173 12.8741 2.4958 2.3933 2.1889 1.9957 2.7357 2.1799 1.8840 1.8691 1.8292 1.4573 1.5339 1.4214 1.4512 1.5207 1.2556 1.8009 1.9044 1.6257 2.2911 2.6836 1.7835 1.7067 1.4873 1.4663 1.3263 1.2999 1.5096 1.4242 1.5294 1.5310 1.5045 1.4154 1.4630 1.5596 5.1657 1.2139 2.9694 1.0876 1.1647 1.0837 1.0858 1.0946 1.0592 1.0619 2.7215 7.1873 6.4872 11.9466 1.0798 1.0813 1.0683 1.0656 1.0748 1.0652 1.0647 1.0598 1.0396 1.0940 1.0945 1.1019 1.0953 1.1010 1.0968 1.0990 1.0886 1.0917 1.0936 1.0667 1.0660
irintensity: 0.0209 0.6117 0.6985 0.3098 0.1557 0.4913 0.2928 0.8183 0.1049 2.5056 0.8043 1.3054 3.2786 1.8658 4.0242 4.5096 152.7800 2.0535 5.2429 2.4763 4.5194 140.4619 3.3134 4.6949 0.3064 3.9295 1.4837 4.1687 0.5354 5.8117 0.8530 2.4760 0.0983 8.4147 2.5461 14.2978 1.7052 8.1232 10.1567 4.0822 7.0853 5.2956 12.3429 0.2909 9.3387 14.1964 27.0780 5.2124 2.5011 8.9825 12.6732 15.6493 44.2969 8.7610 34.4620 66.8412 7.8627 48.4888 260.0070 265.1413 53.0099 6.5028 2.5660 9.1510 6.5800 2.9928 1.8239 38.5891 15.1507 35.7494 45.6598 82.9185 33.3444 40.6372 13.1898 3.0870 7.3544 20.5940 243.3480 219.3634 76.4872 33.7679 14.7896 38.4530 30.4494 1.5443 23.5699 2.0238 4.8754 3.0626 0.6929 1.9535 2.1432 8.0140 19.0257 26.0992 5.7270 6.1210 3.1794 5.9736 14.5613 3.5513 6.3231 11.7106 101.6329 28.9969 52.1618 228.7508 17.1093 20.2312 9.3631 35.4285 22.4553 28.4437 66.5628 19.9452 21.3939 38.9555 41.5459 29.0804 12.8745 73.3260 31.7551 21.8430 20.5331 16.9090 9.9734 11.2019 38.7957
temp: 298.150 k
press: 1.00000 atm
elementType: 9 9 9 8 8 6 6 6 6 6 6 6 6 6 6 6 6 6 6 6 6 6 6 6 1 1 1 1 1 1 1 1 1 1 1 1 1 1 1 1 1 1 1 1 1
symmnumber: 1
zpe: 935958.7 jmol-1
zpe.correction: 0.356488 hartree
zpe.thermalcorrener: 0.378481 hartree
zpe.thermalcorrenthalpy: 0.379425 hartree
zpe.thermalcorrgfe: 0.305354 hartree
zpe.sumelectzpe: -1184.748949 hartree
zpe.sumelectthermal: -1184.726956 hartree
zpe.sumelectthermalent: -1184.726012 hartree
zpe.sumelectthermalfe: -1184.800083 hartree
dipole: -2.2091 0.8684 -1.8804
dipole: 3.0282
quadrupole: -172.1780 -130.3042 -141.6405
quadrupole: 20.4655 -4.0491 -1.3828
quadrupole: -24.1371 17.7367 6.4004 20.4655 -4.0491 -1.3828
hfenergy: -1185.1054371 hartree
pointgroup: C01 [X(C19H21F3O2)]
dipole: 0.8687933 -0.3775985 -0.722513 debye
polarizability: 293.4261584|0.8135371|209.0915587|7.1704227|-7.1038341|134.8525047 unknown
InChI: InChI=1S/C19H21F3O2/c1-18(17(24)7-9-19(20,21)22)8-6-16-13(11-18)3-2-12-10-14(23)4-5-15(12)16/h4-5,10,13,16-17,23-24H,2-3,6,8,11H2,1H3
charge 0 multiplicity 1
45 atoms
F  -6.147137 1.999997 -1.068864
F  -7.141905 0.322086 0.097686
F  -5.881149 1.869866 1.182236
O  -2.926621 -2.699379 -0.039981
O  7.058326 1.563557 0.276755
C  1.225184 -1.399598 0.138699
C  -1.307009 -0.856023 0.117686
C  1.546604 -0.034499 -0.52661
C  -0.189791 -1.878738 -0.252695
C  -0.944617 0.538506 -0.478604
C  0.479819 1.01021 -0.104766
C  2.311734 -2.431512 -0.228788
C  2.998063 0.402755 -0.275136
C  -2.628638 -1.350049 -0.56185
C  3.666918 -2.007015 0.372077
C  -1.518725 -0.780014 1.650371
C  3.999418 -0.538155 0.116354
C  3.39531 1.747562 -0.486481
C  5.33678 -0.113466 0.290771
C  -3.782302 -0.45276 -0.346722
C  4.727703 2.174824 -0.313834
C  5.703172 1.230636 0.081783
C  -4.776834 0.256434 -0.18898
C  -5.946282 1.08483 -0.000118
H  1.262355 -1.259652 1.241001
H  1.429962 -0.185178 -1.626548
H  -0.209507 -2.055835 -1.35081
H  -0.410531 -2.849017 0.228008
H  -1.68571 1.29191 -0.14828
H  -1.011753 0.485725 -1.587145
H  0.659648 1.981048 -0.60264
H  0.559905 1.19674 0.984088
H  2.389456 -2.505022 -1.333058
H  2.032732 -3.435775 0.145315
H  -2.445963 -1.402445 -1.65962
H  4.48324 -2.643399 -0.019645
H  3.64166 -2.17999 1.468494
H  -2.302523 -0.043472 1.907048
H  -1.827023 -1.762862 2.045526
H  -0.593967 -0.47396 2.167252
H  2.653242 2.489559 -0.799949
H  6.113024 -0.827011 0.588441
H  -3.753827 -3.043202 -0.464427
H  5.000064 3.224235 -0.487293
H  7.209794 2.525047 0.100161
