program: Gaussian 09
title: 000017262
version: EM64L-G09RevD.01
frameworkgroup: C1[X(C10H12O3)]
method: RPBEPBE
basis: SDD
operation: Freq
keyword: #pfreq=noraman
keyword: PBEPBE/SDD
title: #p freq=noraman PBEPBE/SDD
converged: YES YES NO NO
title: Mulliken charges:
elementType: O O O C C C C C C C C C C H H H H H H H H H H H H
charge: -0.291635 -0.452963 -0.209819 0.521588 -0.631512 -0.558896 -0.385018 0.236558 0.169536 -0.351562 0.228954 -0.763459 -0.519395 0.253048 0.212806 0.260339 0.258568 0.215594 0.253836 0.237624 0.249661 0.210132 0.265271 0.229811 0.360933
chargesum: 0.00000
title: Mulliken charges with hydrogens summed into heavy atoms:
elementType: O O O C C C C C C C C C C
charge: -0.291635 -0.092030 -0.209819 0.521588 -0.165658 -0.298557 -0.126450 0.236558 0.169536 -0.135968 0.228954 -0.022338 0.185819
polarizability: 1.62143039e+02 -6.84659563e+00 1.20956323e+02 8.23842790e+00 7.59817835e+00 7.49212121e+01
1716.lowfreq: -7.0268 -1.9648 -0.0005 -0.0003 -0.0003 11.3252 25.3782 37.4487 51.7377
frequency: 25.2034 37.4354 51.6955 73.8428 119.3263 123.2076 149.7489 205.2375 234.9788 283.0794 315.9274 330.2666 350.6079 383.5893 414.4197 448.1566 462.2503 510.6097 557.3180 585.4317 637.5124 703.9754 723.0472 752.8478 784.7211 806.4933 869.9570 892.0613 896.7262 929.4694 986.5744 1014.4141 1018.3633 1078.6804 1114.0002 1134.8628 1150.6287 1160.3468 1165.0566 1225.5881 1236.3573 1263.3330 1269.8619 1287.9477 1367.0748 1390.8842 1410.0094 1441.4616 1442.9550 1454.4266 1455.2040 1455.9481 1479.6552 1499.1647 1595.8181 1612.9176 1634.6422 2976.7013 2980.4371 3006.1743 3067.1491 3075.1557 3087.8849 3107.7324 3123.1881 3130.6767 3146.6786 3153.1342 3580.8462
redmass: 4.2567 4.2799 2.0016 5.0435 1.0675 1.8403 2.6780 3.4627 4.3316 4.4584 3.2067 1.3115 3.3360 2.3855 4.9005 4.1029 3.2989 3.5335 3.7250 4.2531 4.2147 5.2229 4.1368 3.8576 2.5573 1.7258 2.5841 1.5048 2.6277 1.3335 2.8747 2.1009 1.8276 2.3396 1.2394 1.3973 1.4688 1.7099 1.1757 2.0680 2.4757 1.9063 2.5170 1.4216 1.2561 6.3466 2.2407 1.1545 1.2765 1.0829 1.0622 1.0762 1.0571 2.9006 6.6273 6.8422 7.8238 1.0354 1.0382 1.0584 1.0942 1.1039 1.0962 1.0891 1.1007 1.1051 1.0917 1.0952 1.0660
irintensity: 2.1532 6.5213 9.0599 0.4759 0.1957 2.6392 4.6048 1.6832 2.3418 4.6429 9.3773 113.5666 23.8569 0.6095 1.5749 2.4529 8.2779 20.5701 9.4295 4.0741 13.7324 1.0359 4.1120 18.9176 20.3576 18.6409 23.5023 17.4889 6.7729 1.1987 27.0817 28.2553 1.1859 109.9150 5.3762 20.5812 83.8243 22.8231 55.1376 33.1520 123.0358 160.8396 44.0498 13.5427 61.1383 0.6534 23.4080 7.5892 21.3411 5.4158 30.4688 15.2373 32.9920 115.4887 59.8791 25.2325 116.8586 82.0657 2.6971 21.1717 12.3305 9.3879 38.2960 18.2138 14.0651 14.7466 5.8505 1.8445 38.5264
temp: 298.150 k
press: 1.00000 atm
elementType: 8 8 8 6 6 6 6 6 6 6 6 6 6 1 1 1 1 1 1 1 1 1 1 1 1
symmnumber: 1
zpe: 517032.5 jmol-1
zpe.correction: 0.196927 hartree
zpe.thermalcorrener: 0.210723 hartree
zpe.thermalcorrenthalpy: 0.211667 hartree
zpe.thermalcorrgfe: 0.154772 hartree
zpe.sumelectzpe: -612.934657 hartree
zpe.sumelectthermal: -612.920861 hartree
zpe.sumelectthermalent: -612.919917 hartree
zpe.sumelectthermalfe: -612.976813 hartree
dipole: 2.3093 -0.4148 1.3476
dipole: 2.7057
quadrupole: -84.6722 -66.1874 -77.5453
quadrupole: 12.5953 8.7458 0.1450
quadrupole: -8.5372 9.9476 -1.4104 12.5953 8.7458 0.1450
hfenergy: -613.1315843 hartree
pointgroup: C01 [X(C10H12O3)]
dipole: -0.7712031 0.4981153 0.5388073 debye
dipolederiv: -0.9936623 0.700212 0.0315081 0.6395792 -0.9556355 -0.1007265 -0.0696507 0.0734198 -0.330134 -1.2888298 -0.1292971 0.3770461 -0.1163002 -0.1633323 -0.0808837 0.4291824 -0.0813181 -0.50841 -0.6996471 0.1773321 -0.1202389 0.3086762 -0.7290735 0.0077911 -0.3148541 0.0415773 -0.4000702 0.2999129 -0.0536981 -0.0547934 0.0083014 -0.0160157 -0.0453602 -0.2979647 0.0104184 -0.0541849 -0.4837509 0.0228192 -0.1667429 0.0387964 0.0577009 -0.0677969 -0.2043547 -0.0397708 -0.035928 -0.1914091 0.1084315 -0.0588149 -0.011451 -0.1177924 -0.0748373 0.0220721 -0.1522899 -0.0719747 -0.1742901 0.0472889 -0.0467873 -0.078108 -0.061068 -0.0408598 0.036359 -0.1030431 -0.1094627 0.5023391 -0.515272 0.0970667 -0.8132951 0.8413457 -0.0005043 0.397146 -0.332088 -0.0198361 1.0317395 0.0917934 -0.4145734 0.2714454 -0.1342968 -0.045764 -0.6037159 0.1053986 0.2028311 -0.1311287 -0.0934406 0.0258735 0.0915768 0.0288977 -0.1372256 -0.0738067 -0.0647375 -0.0922576 0.9585916 -0.0994759 0.3944476 -0.1270688 0.9646101 0.1421752 0.8219995 0.1029571 0.4130899 -0.0378276 -0.090471 -0.0760641 -0.1506397 -0.4426982 -0.1462075 -0.1575987 -0.1208254 -0.0190523 0.5498989 -0.3165528 -0.049703 -0.1709733 0.4413458 0.1444062 -0.2305935 0.3293937 0.3565771 0.0052251 0.0109676 0.0351614 0.0317385 -0.0417205 -0.1095682 0.0306824 -0.0462293 0.0213462 0.0628138 0.0022689 -0.0006304 -0.0716262 -0.0348757 0.1289204 0.0211817 0.0735697 0.011511 0.0972203 -0.0384149 0.0561737 -0.0320554 0.0227272 0.0853895 0.0507615 0.0874991 0.0775104 0.0436863 0.0990037 0.0027878 0.0827212 0.0304172 0.0361196 -0.0008951 0.0399873 0.1231691 0.0251585 -0.0613296 0.09033 -0.0415967 -0.0013862 0.1084919 0.0941849 0.1189593 0.0608097 0.0359659 -0.0070514 -0.0982164 0.0087253 0.0835779 0.0184046 -0.1283269 -0.0270837 -0.0296412 0.0712156 -0.0616609 0.0501499 -0.0298957 0.0547175 0.0476061 0.0957991 0.0674552 -0.0153055 -0.0424349 0.0932453 0.041395 0.0876461 0.0736297 -0.0081995 0.0203991 -0.0336635 0.0958772 -0.048746 -0.0524561 -0.1205996 0.0069911 0.0109679 -0.0679025 0.0126464 -0.1889282 -0.0861554 -0.0200443 -0.0327284 0.0656471 -0.1176756 0.0706588 0.0286091 0.1160418 -0.0475702 0.0404877 0.0409373 0.1059773 -0.0195744 0.1438751 -0.0872698 0.0559434 -0.0443611 0.0849743 0.0371144 0.3870661 0.0925087 -0.0408482 0.0406131 0.1045681 0.1219792 -0.0223342 0.101938 0.332089 unknown
polarizability: 153.2753994|-20.0096892|120.5313304|-16.4698807|-14.5350339|84.2138442 unknown
InChI: InChI=1S/C10H12O3/c1-7(11)5-8-3-4-9(12)10(6-8)13-2/h3-4,6,12H,5H2,1-2H3
charge 0 multiplicity 1
25 atoms
O  -2.043273 1.651546 -0.709778
O  -2.983001 -0.499423 1.000262
O  4.019654 -1.55738 0.134629
C  0.91935 -0.583255 -0.704006
C  2.311716 -0.619203 -1.334969
C  0.043944 0.505673 -0.921897
C  0.490674 -1.641902 0.13622
C  -1.245917 0.556472 -0.34366
C  -1.673016 -0.528364 0.475719
C  -0.792745 -1.608064 0.718028
C  3.402642 -0.52931 -0.250802
C  3.675874 0.850143 0.332762
C  -2.845685 2.324403 0.3334
H  2.467004 -1.56581 -1.882211
H  2.422202 0.222442 -2.042996
H  0.333933 1.346027 -1.56215
H  1.157851 -2.488273 0.331228
H  -1.124774 -2.439084 1.355407
H  4.289239 0.769775 1.243385
H  4.222317 1.462928 -0.41122
H  2.729867 1.375604 0.555633
H  -2.190056 2.692532 1.146299
H  -3.610155 1.648356 0.746863
H  -3.313615 3.176123 -0.18329
H  -3.167229 -1.329658 1.505645
