program: Gaussian 09
title: 000195713
version: EM64L-G09RevD.01
frameworkgroup: C1[X(C23H22O11)]
method: RPBEPBE
basis: SDD
operation: Freq
keyword: #p
keyword: freq=noraman
keyword: PBEPBE/SDD
title: #p freq=noraman PBEPBE/SDD
converged: YES YES NO NO
title: Mulliken charges:
elementType: O O O O O O O O O O O C C C C C C C C C C C C C C C C C C C C C C C H H H H H H H H H H H H H H H H H H H H H H
charge: -0.226791 -0.299585 -0.469030 -0.462150 -0.456474 -0.310732 -0.360607 -0.202321 -0.173651 -0.221567 -0.420234 -0.146564 -0.152899 -0.115887 -0.113975 -0.151101 -0.305574 0.277371 0.055923 -0.577453 0.352872 0.133893 0.059050 -0.229438 -0.161709 0.305811 0.268970 -0.868432 0.311877 -0.558742 -0.364937 -0.757513 0.303128 -0.356469 0.233559 0.257092 0.269866 0.246038 0.298601 0.265739 0.260647 0.373705 0.369464 0.368261 0.342862 0.240371 0.288938 0.242875 0.285457 0.292484 0.374396 0.247984 0.251110 0.258883 0.262214 0.364394
chargesum: 0.00000
title: Mulliken charges with hydrogens summed into heavy atoms:
elementType: O O O O O O O O O O O C C C C C C C C C C C C C C C C C C C C C C C
charge: -0.226791 -0.299585 -0.095325 -0.092686 -0.088213 -0.310732 0.013789 -0.202321 -0.173651 -0.221567 -0.055840 0.086995 0.104193 0.153979 0.132062 0.147500 0.220812 0.277371 0.055923 -0.234591 0.352872 0.133893 0.059050 -0.229438 -0.161709 0.305811 0.268970 -0.096248 0.311877 -0.273285 -0.072453 0.000463 0.303128 -0.094255
polarizability: 4.32864690e+02 4.29410092e+01 2.09204495e+02 -1.90026416e+01 -1.71624918e+01 3.01597470e+02
1716.lowfreq: -8.3361 -6.3414 -4.3811 -0.0009 -0.0006 0.0003 8.0754 11.9389 14.1373
frequency: 5.4297 11.8628 13.7580 31.3543 33.4728 36.7457 44.3975 49.6297 59.1008 75.1262 94.8714 100.1686 102.3585 117.4472 145.3311 152.8994 156.2173 159.6104 177.6458 187.5493 215.5085 221.6265 237.6293 245.4883 254.4488 256.5467 272.3600 289.3959 297.9473 321.6195 328.1288 349.9272 356.5399 369.9877 378.9863 389.7396 396.3480 399.9418 408.6612 409.6391 425.1565 433.1523 441.4829 452.2074 462.6095 477.4616 479.9465 488.1221 503.2544 505.8772 520.6170 560.6068 561.5314 573.9655 583.9966 612.5624 617.2157 620.6331 645.0972 672.2044 682.8263 708.1511 717.2487 732.6098 751.4507 768.0876 784.3670 805.6872 846.8840 852.4496 880.8656 890.4159 896.4220 907.3548 922.5196 930.4124 930.9093 939.9892 968.3435 976.6151 990.3391 999.9936 1000.3586 1005.8911 1037.8256 1040.1745 1041.7490 1048.3763 1050.9893 1070.4571 1084.7494 1090.6235 1099.8468 1105.3163 1131.7159 1138.1506 1170.7095 1171.8253 1184.3078 1189.0811 1199.2567 1202.9214 1218.9660 1225.7736 1231.0896 1233.1416 1273.1632 1280.1781 1288.2757 1298.6053 1304.0584 1305.4646 1322.5281 1326.4305 1334.7609 1342.8180 1366.3701 1375.9294 1384.4382 1386.1382 1392.0503 1397.4124 1402.4311 1414.3528 1421.4217 1440.4914 1453.3952 1457.3707 1460.9387 1471.5316 1473.3835 1486.3922 1490.6862 1532.2674 1542.9038 1578.8844 1590.6871 1604.1251 1620.9486 1671.3202 2956.8629 2965.3752 2985.5741 3001.4141 3006.3926 3024.9963 3031.9416 3043.0981 3072.2967 3094.5384 3110.9751 3119.9547 3129.3888 3143.8552 3158.6101 3172.1348 3178.0181 3527.3700 3528.4787 3545.1696 3565.4918 3577.3472
redmass: 6.9761 6.7864 6.7379 1.9813 6.0867 2.2222 5.4377 3.6760 5.2838 6.1281 5.7179 5.4611 4.5226 5.8738 4.2417 5.0613 6.6967 1.3393 4.9277 5.2866 3.5248 4.5026 5.5029 4.4326 4.7959 5.3516 5.6513 4.5660 6.4395 2.8345 3.2270 4.3901 4.4830 7.3448 8.0702 1.8561 1.8561 2.1807 5.6284 1.1451 3.2356 3.3451 1.2703 11.3449 3.2476 1.9354 2.1294 4.6028 5.8208 4.9764 5.8429 3.1848 3.6316 5.7493 5.4346 5.9633 4.5673 5.7580 5.7172 6.8747 3.9717 6.0534 5.2854 4.5527 5.8219 7.2481 6.5820 5.6572 1.6736 6.1537 2.0099 2.3167 3.7958 1.6860 3.6519 5.2464 4.1003 2.2356 5.0038 3.5770 2.5139 1.3670 3.3104 2.8617 1.5617 3.3151 1.6675 3.6794 3.8097 2.8338 3.0975 2.4305 2.2367 2.1775 2.5054 1.5870 1.2975 1.6905 2.8010 1.9808 1.2838 2.6164 1.5758 1.1971 1.2592 1.7159 1.2003 2.5193 1.2999 1.3142 1.3483 2.5605 1.3097 1.5552 2.2542 1.3630 1.4655 1.8126 1.3962 2.9125 1.4647 1.6230 1.4863 6.1117 4.2879 5.1578 1.0584 1.0473 1.9367 1.5267 1.1537 3.3330 1.0444 10.2778 9.2121 7.0421 7.1193 8.0485 7.5110 9.8920 1.0417 1.0833 1.0830 1.0856 1.0374 1.0981 1.0600 1.0832 1.0875 1.0973 1.1091 1.0920 1.0919 1.1005 1.0886 1.0917 1.0970 1.0656 1.0647 1.0654 1.0657 1.0661
irintensity: 0.9538 0.0868 0.7623 2.0616 4.2412 0.5976 1.1995 0.7546 0.3583 0.3442 0.5948 2.2217 2.0919 2.4034 1.6666 2.1563 1.3441 0.5368 3.9323 4.6972 3.3547 2.9699 1.5195 7.2632 22.1850 6.1381 4.7267 2.3824 3.8095 24.9176 14.2188 17.9084 15.1326 18.2307 2.5355 36.3892 46.4404 63.9812 2.9205 164.6663 17.3128 20.3958 175.4428 2.7036 52.2186 86.7189 34.2914 5.1221 1.8299 11.9208 21.1544 5.1742 6.7865 10.8515 4.9936 6.1062 13.8508 15.4620 71.0784 8.9843 5.0036 15.4108 20.6304 0.7610 71.1275 20.1940 26.1247 30.4833 8.3103 344.9884 43.5659 2.8558 14.3977 3.9493 123.7005 65.9766 6.4865 6.1462 317.7774 33.0321 69.9063 1.2447 51.5063 113.6570 9.3420 110.2426 7.0742 110.4281 8.3633 21.6653 103.3558 7.2231 36.4376 134.2344 15.7808 392.6912 27.7113 27.1557 330.0340 19.2016 0.3346 90.1364 5.2327 35.5084 44.2953 11.6856 5.3642 447.5512 18.5637 34.9356 20.6153 58.5233 206.7370 172.3583 286.6969 25.7902 3.3287 27.9123 50.4608 36.7805 5.4057 18.4431 6.2021 45.0420 29.4168 28.4234 25.5244 20.3097 12.4033 2.2183 11.9747 1.6394 14.4651 109.2595 342.2776 24.5571 176.9818 23.0546 40.9678 172.7642 25.2267 16.8390 4.1344 54.4886 1.5355 14.8956 6.0630 25.1317 5.5570 6.2238 11.7490 2.9471 10.2397 7.4469 0.0312 7.1446 8.9867 60.1044 36.4709 28.5092 25.4485 72.7076
temp: 298.150 k
press: 1.00000 atm
elementType: 8 8 8 8 8 8 8 8 8 8 8 6 6 6 6 6 6 6 6 6 6 6 6 6 6 6 6 6 6 6 6 6 6 6 1 1 1 1 1 1 1 1 1 1 1 1 1 1 1 1 1 1 1 1 1 1
symmnumber: 1
zpe: 1095072.5 jmol-1
zpe.correction: 0.417091 hartree
zpe.thermalcorrener: 0.449683 hartree
zpe.thermalcorrenthalpy: 0.450627 hartree
zpe.thermalcorrgfe: 0.348341 hartree
zpe.sumelectzpe: -1714.611749 hartree
zpe.sumelectthermal: -1714.579157 hartree
zpe.sumelectthermalent: -1714.578213 hartree
zpe.sumelectthermalfe: -1714.680499 hartree
dipole: -6.1931 1.8705 0.2507
dipole: 6.4742
quadrupole: -184.9266 -193.2476 -190.8931
quadrupole: -13.3951 -23.1939 -9.1015
quadrupole: 4.7625 -3.5585 -1.2040 -13.3951 -23.1939 -9.1015
hfenergy: -1715.02884 hartree
pointgroup: C01 [X(C23H22O11)]
dipole: 2.3261565 0.9978349 0.2851909 debye
polarizability: 442.54709|-13.302758|200.4790582|-11.671674|-4.8826902|300.6405066 unknown
InChI: InChI=1S/C23H22O11/c1-8-14(33-23-22(31)21(30)20(29)15(34-23)7-32-9(2)24)6-13-16(17(8)26)19(28)11-4-3-10(25)5-12(11)18(13)27/h3-6,15,20-23,25-26,29-31H,7H2,1-2H3
charge 0 multiplicity 1
56 atoms
O  2.208983 -0.413013 1.730853
O  1.941498 -1.099755 -0.579148
O  5.655371 1.020261 1.531643
O  6.101731 -1.668129 0.903431
O  3.694126 -3.437928 1.255261
O  3.571117 2.944066 0.851696
O  -1.464221 -0.530138 -3.941358
O  -2.409676 -0.680973 2.087721
O  -4.015717 -0.330675 -3.184981
O  2.018244 4.365301 -0.143792
O  -7.552462 -0.172471 2.162244
C  4.532896 0.248789 0.986277
C  4.789063 -1.213813 1.361958
C  3.190327 0.699949 1.610585
C  3.751842 -2.101947 0.665113
C  2.328825 -1.508977 0.79022
C  2.538916 1.857637 0.84397
C  0.570521 -0.914682 -0.863134
C  0.245361 -0.807591 -2.238663
C  -0.424862 -0.838911 0.132085
C  -1.773572 -0.677174 -0.244421
C  -2.166642 -0.575228 -1.617679
C  -1.124186 -0.634494 -2.596704
C  -2.774341 -0.606136 0.870124
C  -3.605321 -0.415526 -1.983455
C  -4.20836 -0.446185 0.503092
C  -4.597677 -0.359144 -0.861133
C  1.309782 -0.890914 -3.314573
C  3.162751 4.186186 0.314911
C  -5.17467 -0.385879 1.534024
C  -5.975479 -0.21221 -1.171266
C  4.289979 5.191187 0.385992
C  -6.537129 -0.239399 1.201953
C  -6.942013 -0.15243 -0.156469
H  4.503997 0.351295 -0.120065
H  4.70424 -1.328083 2.462788
H  3.38609 1.00337 2.655055
H  4.02641 -2.15653 -0.408132
H  1.634357 -2.276812 1.170519
H  1.621518 2.218312 1.337827
H  2.308932 1.587652 -0.200963
H  5.469971 1.979759 1.353763
H  6.765602 -0.989456 1.193185
H  4.608888 -3.819462 1.231139
H  -0.193048 -0.87396 1.19942
H  1.370357 0.041413 -3.912324
H  2.297293 -1.053131 -2.859991
H  1.127494 -1.735695 -4.009346
H  -4.827364 -0.457057 2.572246
H  -6.258776 -0.147025 -2.226095
H  -0.652305 -0.576409 -4.510107
H  5.131707 4.866991 -0.251459
H  4.667358 5.276333 1.419335
H  3.930281 6.170555 0.040143
H  -8.006239 -0.039517 -0.381908
H  -7.183672 -0.241098 3.078194
