program: Gaussian 09
title: 000017236
version: EM64L-G09RevD.01
frameworkgroup: C1[X(C11H12O2)]
method: RPBEPBE
basis: SDD
operation: Freq
keyword: #pfreq=noraman
keyword: PBEPBE/SDD
title: #p freq=noraman PBEPBE/SDD
converged: NO YES NO YES
title: Mulliken charges:
elementType: O O C C C C C C C C C C C H H H H H H H H H H H H
charge: -0.273445 -0.254375 0.474176 -0.431513 -0.385959 -0.386005 -0.224497 -0.224492 -0.231530 0.168336 0.345049 -0.752110 -0.632065 0.234782 0.234770 0.234687 0.234684 0.228766 0.228765 0.230998 0.242224 0.242236 0.213078 0.228719 0.254722
chargesum: 0.00000
title: Mulliken charges with hydrogens summed into heavy atoms:
elementType: O O C C C C C C C C C C C
charge: -0.273445 -0.254375 0.474176 0.038040 -0.151273 -0.151322 0.004269 0.004273 -0.000532 0.168336 0.345049 -0.054572 -0.148624
polarizability: 1.79417332e+02 -1.87657569e+01 9.26057966e+01 1.72067521e-02 8.98479140e-03 1.00799786e+02
1716.lowfreq: -11.6760 -6.3638 0.0003 0.0006 0.0006 6.7973 13.7296 23.3035 60.3542
frequency: -11.6083 23.2859 60.3542 64.4782 137.3142 159.5282 169.6735 232.7220 295.4036 321.0948 369.6450 393.1926 403.4135 448.4106 522.3592 552.0683 593.8366 617.7382 634.0991 701.8054 755.9723 781.4261 784.1833 853.5517 859.2316 884.2822 932.1572 944.7752 949.7224 977.4740 989.8620 991.0402 997.3524 1010.0423 1027.3833 1053.1539 1088.5835 1106.4097 1173.2728 1187.7320 1188.4170 1227.4801 1284.8628 1325.2712 1350.6579 1386.5773 1396.9482 1415.6789 1440.7651 1455.2194 1468.7836 1471.8296 1488.1255 1596.6738 1601.4871 1618.5388 1653.5675 2990.5328 3012.8983 3074.3682 3075.9519 3098.8529 3104.1145 3122.2609 3124.1994 3136.3589 3149.4463 3165.4206 3216.4606
redmass: 3.7663 3.8585 4.4156 4.2676 4.5190 4.5820 1.0589 5.9925 4.0262 2.2023 2.8849 3.5298 2.8083 3.8506 4.7071 4.0679 4.2767 6.3283 1.5528 1.7984 1.9270 5.8703 2.0444 1.2473 3.7358 5.5682 1.6408 1.6357 2.0099 1.3931 1.3167 6.1345 1.3261 1.3964 2.1685 1.5041 1.5148 4.8984 1.0540 1.1150 1.0911 2.3050 3.0782 1.2754 1.5998 8.8232 1.1684 1.2498 2.2017 1.0448 1.0945 1.0642 2.4380 6.1516 11.5717 6.2272 5.1227 1.0360 1.0578 1.0972 1.1071 1.1011 1.0619 1.0853 1.0884 1.0919 1.0963 1.1017 1.1156
irintensity: 0.0037 0.8404 0.4232 1.6969 3.0612 3.1969 1.3698 4.6207 2.1190 1.1536 4.4214 0.2890 0.0174 1.6496 16.4508 4.3935 10.7401 0.1014 9.3699 51.8859 69.9322 1.2484 8.4996 0.0028 13.8718 65.5599 0.6347 2.2181 25.7775 0.0295 59.3813 1.2936 0.1748 18.3989 4.4073 6.4414 7.2267 521.4866 0.0000 0.1402 1.5925 6.6198 120.4083 0.2419 2.5404 0.2940 23.3843 11.9801 9.0653 15.9808 12.2203 37.6071 7.6184 0.6929 164.2430 1.0525 5.5377 15.4078 17.8416 10.9073 16.5398 28.4924 5.7429 5.0441 2.3151 14.5578 39.6655 20.2395 5.7006
temp: 298.150 k
press: 1.00000 atm
elementType: 8 8 6 6 6 6 6 6 6 6 6 6 6 1 1 1 1 1 1 1 1 1 1 1 1
symmnumber: 1
zpe: 524501.4 jmol-1
zpe.correction: 0.199772 hartree
zpe.thermalcorrener: 0.211588 hartree
zpe.thermalcorrenthalpy: 0.212532 hartree
zpe.thermalcorrgfe: 0.160347 hartree
zpe.sumelectzpe: -575.852303 hartree
zpe.sumelectthermal: -575.840487 hartree
zpe.sumelectthermalent: -575.839543 hartree
zpe.sumelectthermalfe: -575.891729 hartree
dipole: -1.4439 1.8957 -0.0006
dipole: 2.3830
quadrupole: -68.3321 -80.4926 -71.1763
quadrupole: 5.2199 0.0001 0.0048
quadrupole: 5.0016 -7.1590 2.1574 5.2199 0.0001 0.0048
hfenergy: -576.0520754 hartree
pointgroup: C01 [X(C11H12O2)]
dipole: -0.5752511 0.7402981 -0.0008254 debye
dipolederiv: -2.0157015 0.0843388 -0.0002123 -0.034609 -0.4591323 0.0002723 0.0000622 0.0002295 -0.2373487 -0.7670477 0.000692 -0.0000137 0.222896 -0.9703201 0.0006245 -0.0003608 0.0008173 -0.3157147 0.0695471 -0.0346065 0.000038 0.058107 -0.0963981 0.0000609 -0.0000681 0.0000677 -0.023828 1.1258112 0.0178644 -0.0000391 0.2975329 0.3472122 -0.0000182 -0.0004232 0.0000022 0.3086249 -0.0806576 -0.0435844 0.0853611 -0.0302339 -0.1245317 -0.0249314 0.0202984 -0.0217053 0.0471908 -0.0807124 -0.0437803 -0.085225 -0.0303258 -0.1244119 0.025357 -0.0201653 0.022132 0.0471333 -0.064571 -0.0430838 -0.0918736 -0.0515661 -0.1240762 0.0437722 -0.1070752 0.037236 0.0754424 -0.0645085 -0.0428816 0.0920314 -0.0513052 -0.1242707 -0.0432672 0.1072598 -0.0367435 0.0755684 0.0405506 -0.1096264 0.0001098 -0.0928769 -0.1059893 0.0000903 0.0000884 0.0000902 -0.0468227 2.1006967 0.0304109 0.000157 -0.1800491 1.0741648 -0.0008045 0.0005649 -0.0009463 0.2182436 -0.3597509 -0.2895456 0.0002913 -0.2490921 0.1631045 -0.0003256 0.0001467 -0.0003618 -0.0496858 -0.0605506 0.1040696 -0.0001321 0.0883573 -0.1074857 0.0002205 -0.0001561 0.0002114 0.0612701 -0.0319115 0.1619381 -0.0000739 -0.0729774 -0.0455855 -0.0002966 0.000109 -0.0002791 -0.332883 -0.0553741 0.0108123 -0.0181193 -0.0921544 0.0130615 0.0436491 -0.0202514 0.1024317 -0.0487213 -0.0553829 0.0108058 0.0180756 -0.0920955 0.0127429 -0.0437981 0.0204539 -0.1025829 -0.048446 0.0659122 0.052398 -0.0945494 0.0522787 0.1194569 0.0422737 -0.0865179 0.0324371 -0.0447441 0.0659704 0.0526131 0.094392 0.0524678 0.1192808 -0.0426912 0.0863432 -0.0328496 -0.0446275 0.0420745 0.0484639 0.0798327 0.0578812 0.134277 -0.0363233 0.0973073 -0.0389535 -0.0702938 0.0420086 0.0482863 -0.0799972 0.057661 0.1344588 0.0358097 -0.0974907 0.0384447 -0.0704165 -0.0849834 0.1091148 -0.0001019 0.116655 0.1089337 -0.0000461 -0.0001086 -0.0000456 0.0877904 0.0581922 0.0413082 -0.1058969 0.0571082 0.073613 -0.0062588 -0.1107247 0.0363376 -0.0305601 0.0580483 0.0415656 0.1058463 0.0573463 0.0735653 0.0060586 0.1106654 -0.0365255 -0.030341 -0.0694621 -0.1636381 0.0001197 -0.0883837 -0.0503266 0.0001535 0.0000325 0.0001216 0.1114804 0.0037454 -0.0791861 0.000048 -0.1148322 -0.0185544 0.0001667 0.0001061 0.0001953 0.1692344 0.1180572 0.035251 -0.0000685 0.0622099 -0.0227889 0.0002518 -0.0000958 0.000239 0.1924545 unknown
polarizability: 179.7720684|-17.9229409|92.2510792|0.0329273|0.0156228|100.7997668 unknown
InChI: InChI=1S/C11H12O2/c1-9(2)11(12)13-8-10-6-4-3-5-7-10/h3-7H,1,8H2,2H3
charge 0 multiplicity 1
25 atoms
O  0.95581 -0.076599 -0.000077
O  2.614003 -1.717483 0.002038
C  -1.429909 -0.543957 0.000582
C  -0.064166 -1.182475 0.001122
C  -2.081474 -0.237243 1.221864
C  -2.081921 -0.240168 -1.22119
C  -3.358373 0.366281 1.223563
C  -3.358829 0.363345 -1.223857
C  -3.999965 0.667945 -0.000394
C  2.29253 -0.501451 0.000442
C  3.230757 0.67055 -0.000518
C  2.652012 2.069849 -0.002238
C  4.564688 0.396054 0.00021
H  0.116005 -1.804294 0.896064
H  0.115878 -1.806112 -0.892579
H  -1.584763 -0.47097 2.171391
H  -1.585566 -0.476173 -2.170338
H  -3.852945 0.597523 2.173418
H  -3.853751 0.592297 -2.174086
H  -4.992331 1.132633 -0.000767
H  2.00925 2.231131 -0.88606
H  2.008608 2.233036 0.880766
H  3.455858 2.825163 -0.002761
H  5.311798 1.196844 -0.000438
H  4.917597 -0.641024 0.001443
