program: Gaussian 09
title: 000195536
version: EM64L-G09RevD.01
frameworkgroup: C1[X(C18H22FNO2)]
method: RPBEPBE
basis: SDD
operation: Freq
keyword: #p
keyword: freq=noraman
keyword: PBEPBE/SDD
title: #p freq=noraman PBEPBE/SDD
converged: YES YES NO NO
title: Mulliken charges:
elementType: F O O N C C C C C C C C C C C C C C C C C C H H H H H H H H H H H H H H H H H H H H H H
charge: -0.211653 -0.261955 -0.259471 -0.096817 -0.171728 -0.134420 -0.245507 -0.149710 -0.519628 -0.506036 -0.492578 -0.440956 0.481609 0.247139 -0.037759 -0.384929 -0.356485 -0.390774 -0.402438 -0.588271 0.317668 -0.504422 0.293075 0.229231 0.250540 0.219223 0.201842 0.235288 0.219208 0.238055 0.233512 0.218247 0.219342 0.190609 0.238197 0.228652 0.244242 0.251645 0.250331 0.220548 0.214930 0.227940 0.239434 0.245030
chargesum: 0.00000
title: Mulliken charges with hydrogens summed into heavy atoms:
elementType: F O O N C C C C C C C C C C C C C C C C C C
charge: -0.211653 -0.261955 -0.259471 -0.096817 0.121347 0.094812 0.005033 0.069513 -0.082498 -0.048772 -0.040819 -0.031005 0.481609 0.247139 0.200438 -0.156278 -0.112243 -0.139129 -0.152107 -0.152792 0.317668 0.207982
polarizability: 2.53328558e+02 6.43923373e+00 1.63117988e+02 1.27706399e+01 2.32590304e+00 1.74772763e+02
1716.lowfreq: -12.3654 -7.9833 -3.6037 -0.0004 -0.0003 0.0008 28.6990 33.3737 46.9613
frequency: 28.6073 33.3623 46.9410 48.1984 53.5202 73.8998 87.6072 92.7979 119.3402 126.6964 164.3376 183.2060 200.4508 208.0688 228.3939 257.4008 295.1329 305.4765 325.7143 342.5709 361.0959 385.0309 411.0173 422.0556 441.2897 482.5991 502.2864 510.7491 567.5045 576.2059 601.5437 623.1356 631.4031 701.8192 715.3849 732.2914 752.8040 771.5215 778.8762 791.2445 813.5557 815.5624 826.1534 833.6009 870.3499 893.2103 914.5516 917.7685 942.3026 942.8246 944.1733 954.0072 957.8316 975.5391 994.7438 1005.7246 1006.7349 1021.4297 1024.6339 1043.3600 1080.2085 1098.0814 1101.7897 1110.2004 1131.9210 1139.9230 1145.3660 1148.7052 1155.9829 1180.7802 1198.3318 1200.0985 1206.6301 1213.2936 1223.5674 1234.4207 1245.0396 1252.5761 1270.2661 1275.4327 1279.6874 1288.2577 1298.4740 1301.0121 1311.3817 1327.4511 1337.4531 1355.0901 1365.0817 1386.1328 1407.2995 1419.2948 1427.1350 1450.4615 1453.4030 1461.0784 1462.7808 1470.6414 1485.5962 1497.5654 1602.2257 1613.6201 1621.8611 1659.0762 2880.0102 2960.7482 2984.4622 2992.8690 2999.1189 3002.0496 3004.2968 3014.3081 3039.1993 3052.6499 3068.6232 3072.1947 3078.2867 3086.1928 3107.1395 3109.2401 3122.0819 3147.3878 3157.8084 3171.4416 3178.1795 3197.2269
redmass: 3.9329 5.0071 3.9708 4.9091 4.0719 2.4856 1.3043 3.2549 4.6015 3.0260 5.1326 4.2606 3.7990 2.9744 2.8544 3.8867 4.2627 2.9470 3.0726 5.6983 4.6426 2.6814 2.9425 2.9860 3.3996 3.6670 4.1071 3.4248 3.5932 3.3910 1.7156 4.0155 6.2309 4.1369 4.2969 4.0371 4.0209 2.9382 3.3416 2.4796 3.0401 1.3668 1.8983 2.5181 2.5938 2.7303 2.4282 1.8476 1.8645 1.4747 2.0443 1.7301 1.3715 2.9966 2.2787 1.2773 2.7225 1.9586 1.9616 2.2307 2.8161 2.6705 1.4186 1.2855 1.9231 1.7473 1.5618 1.5066 1.5694 1.4917 1.7627 1.6041 2.1325 1.4452 1.6301 1.6765 1.5484 1.3588 1.4048 1.2649 1.3939 1.3208 1.3695 1.4233 1.3708 1.3903 1.4181 1.6628 1.5048 3.8974 2.7745 1.1999 1.2046 1.0512 1.0916 1.0833 1.0513 1.0789 1.0923 2.5994 7.4904 6.3906 9.8142 4.7625 1.0677 1.0799 1.0889 1.0637 1.0794 1.0613 1.0293 1.0632 1.0872 1.1031 1.0921 1.0976 1.1026 1.0602 1.1045 1.0942 1.0894 1.1048 1.0878 1.0951 1.0966 1.1139
irintensity: 0.0381 0.4799 1.7293 0.3457 0.0586 0.5490 0.5547 0.5201 0.1992 0.5867 2.3303 1.7305 1.0104 0.2007 2.0441 5.6482 4.3345 3.2957 2.9136 0.2348 6.2089 2.8268 0.1711 1.7650 2.4583 7.0647 15.7464 5.7190 16.9134 6.7162 12.4883 4.8761 1.0117 4.9101 0.9492 4.2614 0.7804 10.2208 9.7964 30.2760 17.5147 2.9071 29.3811 19.6866 21.6900 3.5947 0.4417 0.5473 58.3915 6.2401 15.9578 45.2802 0.4317 23.3729 5.1969 19.1883 19.4396 22.2095 1.6395 1.8773 19.4201 30.7530 11.6906 0.9440 54.9228 5.5455 7.8703 16.4731 62.0468 16.6873 61.6129 6.8882 35.5282 30.8593 1.1950 17.3108 23.8408 5.8173 14.1398 3.0566 8.9721 3.3759 7.7577 7.9196 0.5569 11.0889 5.1373 5.6310 0.4493 0.5878 1.6634 19.9956 16.1047 10.6110 8.8587 7.6860 8.3663 3.8171 30.4452 132.4046 6.2629 6.8124 174.7029 8.3175 76.8568 19.2819 21.8607 30.3131 9.0024 27.3917 33.0055 45.1855 55.4507 1.3285 8.6248 17.2578 70.9733 14.1476 22.9764 6.7449 13.7123 13.5209 7.1917 6.7254 3.7629 23.8950
temp: 298.150 k
press: 1.00000 atm
elementType: 9 8 8 7 6 6 6 6 6 6 6 6 6 6 6 6 6 6 6 6 6 6 1 1 1 1 1 1 1 1 1 1 1 1 1 1 1 1 1 1 1 1 1 1
symmnumber: 1
zpe: 951030.2 jmol-1
zpe.correction: 0.362228 hartree
zpe.thermalcorrener: 0.383102 hartree
zpe.thermalcorrenthalpy: 0.384046 hartree
zpe.thermalcorrgfe: 0.311113 hartree
zpe.sumelectzpe: -1002.472998 hartree
zpe.sumelectthermal: -1002.452124 hartree
zpe.sumelectthermalent: -1002.451180 hartree
zpe.sumelectthermalfe: -1002.524113 hartree
dipole: -2.4515 -2.0423 1.4433
dipole: 3.5020
quadrupole: -145.3821 -126.7617 -123.5800
quadrupole: 6.2966 -0.4786 7.6309
quadrupole: -13.4741 5.1462 8.3279 6.2966 -0.4786 7.6309
hfenergy: -1002.8352264 hartree
pointgroup: C01 [X(C18H22F1N1O2)]
dipole: -0.984806 0.7854623 -0.558123 debye
polarizability: 251.8467922|-7.6833171|163.4894297|-16.0874487|3.3272476|175.8830868 unknown
InChI: InChI=1S/C18H22FNO2/c1-3-10-20-14-8-9-16(20)17(18(21)22-2)15(11-14)12-4-6-13(19)7-5-12/h3-7,14-17H,1,8-11H2,2H3
charge 0 multiplicity 1
44 atoms
F  5.980278 -0.270651 -0.16119
O  0.182434 -1.806161 -0.548557
O  -0.967509 -2.297092 1.404665
N  -2.479086 0.287657 -0.499235
C  -1.981259 0.496034 0.896013
C  -1.86036 1.452946 -1.213865
C  -0.479126 0.054064 0.908308
C  0.35602 0.975152 -0.041296
C  -0.355127 1.139482 -1.409875
C  -2.152291 2.032182 1.168792
C  -2.090658 2.680152 -0.256391
C  -3.96296 0.216468 -0.620299
C  1.843286 0.611902 -0.107345
C  -0.454884 -1.449769 0.63464
C  -4.510978 -1.023422 0.055196
C  2.620617 0.671313 1.080176
C  2.49576 0.256442 -1.314077
C  4.000502 0.375097 1.079643
C  3.877131 -0.039013 -1.344475
C  -5.6085 -1.048975 0.851302
C  4.598458 0.02406 -0.142065
C  0.200965 -3.25769 -0.851159
H  -2.544962 -0.134325 1.602486
H  -2.341311 1.587965 -2.199025
H  -0.10771 0.166626 1.946546
H  0.321464 1.970834 0.450365
H  0.127047 1.95414 -1.984992
H  -0.278022 0.205483 -1.992452
H  -1.374886 2.425706 1.848275
H  -3.127831 2.219028 1.651446
H  -3.039468 3.190048 -0.500637
H  -1.282961 3.428331 -0.346773
H  -4.184119 0.165721 -1.706443
H  -4.491232 1.117817 -0.224277
H  -3.953413 -1.948686 -0.14997
H  2.145484 0.958934 2.026394
H  1.924575 0.197054 -2.24432
H  4.600801 0.419047 1.99302
H  4.385812 -0.312704 -2.273611
H  -5.975501 -1.983422 1.289626
H  -6.17239 -0.136941 1.086532
H  0.800677 -3.344919 -1.768056
H  -0.827798 -3.622445 -1.010578
H  0.659732 -3.816976 -0.019061
