program: Gaussian 09
title: 000195484
version: EM64L-G09RevD.01
frameworkgroup: C1[X(C11H11NO)]
method: RPBEPBE
basis: SDD
operation: Freq
keyword: #p
keyword: freq=noraman
keyword: PBEPBE/SDD
title: #p freq=noraman PBEPBE/SDD
converged: NO NO NO NO
title: Mulliken charges:
elementType: O N C C C C C C C C C C C H H H H H H H H H H H
charge: -0.428788 -0.023901 0.329426 0.208682 -0.087790 0.389521 -0.053113 -0.556179 -0.313597 -0.837838 -0.872161 -0.192795 -0.378650 0.265511 0.253587 0.280517 0.227617 0.227668 0.233513 0.260350 0.233371 0.224365 0.237607 0.373077
chargesum: 0.00000
title: Mulliken charges with hydrogens summed into heavy atoms:
elementType: O N C C C C C C C C C C C
charge: -0.055712 -0.023901 0.329426 0.208682 -0.087790 0.389521 -0.053113 -0.290669 -0.060009 -0.102036 -0.144927 0.031571 -0.141043
polarizability: 2.00180998e+02 -4.21530064e+00 1.38262824e+02 -1.79875301e-03 -5.78133205e-04 6.05783955e+01
1716.lowfreq: -0.0010 -0.0003 0.0003 10.1862 10.9716 15.4609 108.8116 113.3607 151.6813
frequency: 108.7988 113.3574 151.6685 157.0568 202.3587 256.1515 268.2312 288.6948 300.0793 328.4753 339.3990 423.7776 434.7120 453.3249 529.5294 536.9236 555.8627 581.2575 620.7958 691.1589 696.2929 781.8728 821.0837 823.6860 880.8330 901.9179 932.2056 969.0388 982.8148 1016.2051 1018.8306 1040.5268 1048.9387 1062.0571 1091.4164 1163.4408 1205.6802 1211.8507 1248.8464 1285.3562 1348.5759 1374.5513 1384.0290 1399.7361 1400.6954 1431.3777 1444.6708 1478.9018 1481.2235 1483.5213 1487.7798 1491.2851 1559.0968 1594.1782 1638.8232 2948.3699 2972.6043 3015.4826 3042.0381 3089.4468 3114.1232 3118.8577 3139.5612 3155.4191 3162.5886 3595.6405
redmass: 3.2473 4.6660 1.3223 2.0109 1.0627 1.4512 3.5727 2.7199 2.4440 3.4441 4.1364 5.9376 7.5141 3.9935 4.9023 2.9561 3.8500 3.4911 6.9781 6.1654 4.8789 1.6650 2.3429 3.1966 4.6074 1.4575 1.4149 2.4389 1.3519 2.3012 1.7888 1.5056 1.5086 2.0841 2.7217 1.3658 1.7430 1.4188 2.5103 4.0826 2.6187 3.1033 2.9643 1.2237 1.2905 2.6001 2.5809 1.2188 1.0437 1.4338 1.0468 3.2211 6.4312 6.0125 7.0164 1.0408 1.0402 1.0977 1.0973 1.0938 1.0952 1.0886 1.0893 1.0927 1.0995 1.0655
irintensity: 1.5478 0.0662 3.2299 0.0523 0.5904 97.0286 3.7899 0.4465 21.1500 9.1238 9.6276 1.9691 2.2838 1.7843 3.0982 5.3858 0.4291 1.4635 1.7887 3.5532 2.7341 21.4040 32.3804 26.9361 14.8331 23.5733 0.8394 20.3707 0.9409 0.3336 1.6636 2.8776 5.8959 27.5918 70.4920 41.2665 84.0665 58.1782 15.8014 31.5267 2.8452 5.5802 6.6023 19.6462 11.0573 0.5892 58.1067 29.7078 16.4257 6.9294 15.1005 62.2160 6.7682 3.4353 9.5950 39.1607 28.6515 21.2349 22.1122 10.6870 4.7316 17.4749 15.3116 6.1126 29.1142 54.2841
temp: 298.150 k
press: 1.00000 atm
elementType: 8 7 6 6 6 6 6 6 6 6 6 6 6 1 1 1 1 1 1 1 1 1 1 1
symmnumber: 1
zpe: 501696.4 jmol-1
zpe.correction: 0.191086 hartree
zpe.thermalcorrener: 0.202510 hartree
zpe.thermalcorrenthalpy: 0.203454 hartree
zpe.thermalcorrgfe: 0.154650 hartree
zpe.sumelectzpe: -554.830640 hartree
zpe.sumelectthermal: -554.819216 hartree
zpe.sumelectthermalent: -554.818272 hartree
zpe.sumelectthermalfe: -554.867076 hartree
dipole: 1.9048 0.8933 -0.0006
dipole: 2.1039
quadrupole: -61.1485 -75.9911 -80.0961
quadrupole: -11.2080 -0.0035 -0.0007
quadrupole: 11.2634 -3.5792 -7.6842 -11.2080 -0.0035 -0.0007
hfenergy: -555.0217261 hartree
pointgroup: C01 [X(C11H11N1O1)]
dipole: -0.7591785 -0.3298433 -0.0002441 debye
dipolederiv: -1.422695 -0.2923676 0.0000687 -0.5467673 -0.2447642 -0.0001651 0.0003982 -0.0001163 -0.3982588 -0.1853916 -0.0251492 -0.0000048 0.0560151 -0.3271592 0.0000005 0.0000032 0.0000016 -0.2409167 0.1544253 0.0416394 0.0000109 0.3184927 -0.2552061 -0.000019 0.000017 -0.0000012 0.0414842 -0.3431923 -0.1464496 0.000009 0.1731503 0.3056885 -0.000004 -0.0000484 -0.0001317 -0.0733242 0.1204193 0.0951219 0.0000027 -0.345715 -0.0248459 -0.0000091 0.0000068 0.0000035 0.0494688 0.068832 -0.08729 -0.0000335 -0.415333 0.1162817 0.0000031 -0.0000899 0.0000516 -0.0557145 1.2195098 0.3640297 -0.0000778 0.5509712 -0.0121115 0.0000457 -0.0001658 0.0000055 0.0288478 -0.0500489 -0.0719785 -0.0000022 0.0234909 0.036631 0.000017 -0.0000082 0.000002 -0.164701 0.1153195 -0.0439496 0.0000006 -0.0283703 0.1357855 -0.0000258 0.0000022 -0.0000074 -0.1447346 -0.0083938 0.0317764 -0.000049 -0.0509268 -0.1303133 -0.0000018 -0.000054 0.0001317 0.0883801 -0.0838572 0.0548893 0.0000766 0.0492808 -0.0351033 0.0000606 0.0002608 0.0000476 0.0912404 -0.1172247 -0.0888655 0.0000125 -0.283448 -0.072261 -0.0000004 0.0000103 -0.0000129 -0.1210043 0.1494961 0.0890663 0.0000186 0.2923788 0.2290484 0.0000062 0.0000126 0.0000123 -0.0880573 0.0929164 -0.0043958 -0.0000075 0.0324639 -0.059091 -0.0000021 -0.0000217 0.0000153 0.1525823 0.1053542 -0.0244763 0.0000005 0.0256499 -0.0880247 0.0000065 0.0000061 0.0000026 0.135919 -0.045104 -0.1138329 -0.000163 -0.0213663 0.1003479 -0.0000225 -0.0001268 -0.0000836 0.1157373 0.060936 0.0738535 0.1030065 0.0176472 -0.0092056 -0.0484011 0.0708878 -0.0946709 -0.0462273 0.0612511 0.0736693 -0.1027916 0.0175666 -0.0093178 0.0484631 -0.070722 0.0947561 -0.0465086 -0.0645449 0.0314047 0.0914299 -0.0158824 0.0785471 0.0720396 0.1255029 0.0263686 -0.0423142 0.0960011 -0.103908 0.0000617 0.0264688 -0.0982566 0.0001241 -0.0000186 0.0000918 0.1200615 -0.0647176 0.0312208 -0.0915111 -0.0162002 0.0783865 -0.0722598 -0.1255583 -0.0265391 -0.0421148 -0.0908081 0.0876696 -0.0000117 0.1045656 0.041291 0.0000041 -0.0000137 0.0000043 0.1622111 -0.1271088 -0.0809449 -0.0000113 -0.0970737 0.0398427 -0.0000045 -0.0000149 -0.0000054 0.1317465 0.3586261 0.109267 -0.0000347 0.1329412 0.20381 0.0001448 -0.0002657 0.000074 0.3461974 unknown
polarizability: 199.8888387|-5.9810859|138.5549835|0.0018146|0.0005264|60.5783955 unknown
InChI: InChI=1S/C11H11NO/c1-7-6-10-9(4-3-5-12-10)8(2)11(7)13/h3-6,13H,1-2H3
charge 0 multiplicity 1
24 atoms
O  -3.026543 -1.03625 0.000044
N  1.963553 1.559986 0.000007
C  0.654839 -0.566945 -0.000098
C  -0.634375 -1.208221 -0.000156
C  0.74968 0.879631 -0.000053
C  -1.704937 1.054359 -0.000072
C  -1.774857 -0.390363 -0.000101
C  -0.447772 1.659824 -0.000063
C  1.891247 -1.29909 -0.000041
C  -0.76524 -2.718561 -0.000224
C  -2.98609 1.86982 0.000021
C  3.104902 -0.608438 0.000025
C  3.09115 0.825626 0.000043
H  -0.338681 2.748934 -0.000049
H  1.874378 -2.393757 -0.000027
H  -1.824708 -3.015126 -0.001071
H  -0.28531 -3.167247 -0.891532
H  -0.286819 -3.167205 0.891932
H  -3.608853 1.674079 0.897864
H  -2.758749 2.94812 -0.000649
H  -3.609622 1.673215 -0.89711
H  4.062939 -1.139062 0.000073
H  4.035744 1.38347 0.000091
H  -3.762575 -0.377198 -0.000456
