program: Gaussian 09
title: 000195464
version: EM64L-G09RevD.01
frameworkgroup: C1[X(C10H14INO2)]
method: RPBEPBE
basis: SDD
operation: Freq
keyword: #p
keyword: freq=noraman
keyword: PBEPBE/SDD
title: #p freq=noraman PBEPBE/SDD
converged: YES YES NO NO
title: Mulliken charges:
elementType: I O O N C C C C C C C C C C H H H H H H H H H H H H H H
charge: 0.092759 -0.267973 -0.288379 -0.544387 0.446736 -0.529617 0.166034 -0.411387 -0.527879 0.481023 -0.280273 -0.582792 -0.538997 -0.516568 0.217740 0.196307 0.240427 0.218942 0.258592 0.259791 0.262847 0.265887 0.225816 0.245453 0.224447 0.231187 0.217377 0.236885
chargesum: 0.00000
title: Mulliken charges with hydrogens summed into heavy atoms:
elementType: I O O N C C C C C C C C C C
charge: 0.092759 -0.267973 -0.288379 -0.015653 0.446736 -0.115570 0.166034 0.047982 -0.269287 0.481023 -0.020482 -0.582792 0.156720 0.168881
polarizability: 2.25189505e+02 1.56667296e+00 1.54302725e+02 -6.33471773e+00 4.79238023e-01 7.96992130e+01
1716.lowfreq: -7.2358 -2.4372 -0.0005 -0.0003 -0.0001 1.0542 27.9404 42.9292 52.8007
frequency: 27.7925 42.8792 52.6806 70.4815 91.5591 117.1249 128.0518 142.3018 147.3355 190.5220 196.4740 229.2493 263.0289 270.8606 291.0020 309.9758 346.0950 385.8922 441.2007 456.5261 489.6465 548.5923 565.9633 615.2027 664.7573 702.7029 727.2778 759.9201 772.3926 840.1120 886.1534 906.1026 942.8331 979.3176 987.8489 991.1306 1089.1080 1098.1858 1107.8700 1113.1450 1143.5718 1150.7436 1161.7409 1177.1740 1245.1293 1256.8374 1273.4201 1274.8813 1333.1401 1342.6820 1345.3546 1381.1021 1434.5823 1438.3576 1457.0582 1457.9436 1467.1774 1467.5531 1469.3016 1472.4374 1480.7292 1563.1189 1594.9022 1642.7181 2958.7095 2961.0475 2986.2210 3002.2854 3043.9042 3049.1666 3049.8762 3073.3967 3120.1710 3125.2495 3138.9642 3177.7181 3465.6513 3592.8942
redmass: 3.0807 4.5203 4.1551 3.4377 1.6947 3.9923 3.8565 1.3279 4.1786 5.1447 2.3326 3.6760 1.4380 1.7692 1.4271 3.4011 3.9546 5.5297 6.6661 3.6798 4.4314 2.7320 1.7690 4.9035 7.7036 6.2454 3.1917 2.2409 1.5936 1.5473 2.0070 3.1948 1.3723 4.9791 6.1641 5.5000 1.3750 4.2383 1.2399 1.2621 1.6765 1.4996 1.6112 2.5536 1.7774 2.3321 1.4455 1.3367 1.1704 6.2964 1.2329 4.1937 1.3175 1.1897 1.1769 1.0660 1.0885 1.1262 1.2147 1.0920 1.4800 9.2607 6.9147 1.0909 1.0316 1.0329 1.0589 1.0621 1.1005 1.1043 1.1041 1.1061 1.1005 1.0995 1.0916 1.0908 1.0444 1.0980
irintensity: 3.0084 1.0695 1.8622 4.0174 3.5579 0.7229 3.3146 1.0471 0.5824 2.9405 3.9631 5.4258 0.3866 21.9804 31.1836 5.0990 11.5840 3.9962 2.4521 2.7791 5.2781 95.0478 275.5636 40.4833 15.8571 32.4423 1.7335 5.8276 11.1081 21.7005 22.1486 32.2445 5.9916 50.8009 94.3509 28.4735 10.5405 46.0216 0.0950 0.1894 5.6652 4.6716 13.7794 205.1035 3.6890 4.3973 12.3377 6.5867 2.7697 39.0701 9.2424 25.8716 44.2808 4.2441 21.1097 12.3254 60.3330 38.0963 93.5336 13.6431 44.8958 1.0375 8.5696 39.3178 74.0656 54.6507 27.9485 46.7445 2.7580 36.7504 43.8866 35.6637 29.8156 21.6762 6.7300 3.0474 2.2709 0.5863
temp: 298.150 k
press: 1.00000 atm
elementType: 53 8 8 7 6 6 6 6 6 6 6 6 6 6 1 1 1 1 1 1 1 1 1 1 1 1 1 1
symmnumber: 1
zpe: 584771.8 jmol-1
zpe.correction: 0.222728 hartree
zpe.thermalcorrener: 0.238939 hartree
zpe.thermalcorrenthalpy: 0.239883 hartree
zpe.thermalcorrgfe: 0.176537 hartree
zpe.sumelectzpe: -605.050524 hartree
zpe.sumelectthermal: -605.034313 hartree
zpe.sumelectthermalent: -605.033369 hartree
zpe.sumelectthermalfe: -605.096715 hartree
dipole: -1.3194 -0.9139 3.1479
dipole: 3.5334
quadrupole: -97.4676 -80.9307 -104.0550
quadrupole: 1.0337 -5.7301 4.1530
quadrupole: -3.3165 13.2204 -9.9039 1.0337 -5.7301 4.1530
hfenergy: -605.273252 hartree
pointgroup: C01 [X(C10H14I1N1O2)]
dipole: -0.5283726 -0.2257592 1.2658518 debye
polarizability: 220.0327888|-16.3443442|158.3314455|-13.6970032|3.964273|80.8272092 unknown
InChI: InChI=1S/C10H14INO2/c1-13-9-6-8(11)10(14-2)5-7(9)3-4-12/h5-6H,3-4,12H2,1-2H3
charge 0 multiplicity 1
28 atoms
I  3.592844 -1.738726 -0.406245
O  -1.870988 -1.620286 0.687878
O  2.761361 1.454217 -0.292106
N  -4.332767 1.771005 -0.513328
C  -0.78785 0.506419 0.472202
C  -2.133979 1.173435 0.666281
C  -0.675074 -0.917293 0.453563
C  -3.00398 1.157068 -0.641659
C  0.384436 1.254203 0.241323
C  1.641681 0.64495 -0.000819
C  0.565844 -1.551215 0.210979
C  1.718596 -0.764845 -0.012043
C  -1.809779 -3.08355 0.705466
C  3.504068 1.925267 0.895028
H  -2.708303 0.654446 1.456418
H  -1.99441 2.225347 0.982787
H  -3.131256 0.108104 -0.963204
H  -2.45104 1.676904 -1.446608
H  0.337532 2.349315 0.22917
H  0.64639 -2.640239 0.190001
H  -4.326253 2.777804 -0.326813
H  -4.978416 1.267835 0.101663
H  -1.48789 -3.484585 -0.275182
H  -2.83732 -3.412147 0.919698
H  -1.128311 -3.447851 1.498631
H  3.925504 1.071629 1.459656
H  2.849043 2.524256 1.5577
H  4.318719 2.553133 0.50376
