program: Gaussian 09
title: 000195618
version: EM64L-G09RevD.01
frameworkgroup: C1[X(C20H24N2O4S)]
method: RPBEPBE
basis: SDD
operation: Freq
keyword: #p
keyword: freq=noraman
keyword: PBEPBE/SDD
title: #p freq=noraman PBEPBE/SDD
converged: YES YES NO NO
title: Mulliken charges:
elementType: S O O O O N N C C C C C C C C C C C C C C C C C C C C H H H H H H H H H H H H H H H H H H H H H H H H
charge: 0.963222 -0.220298 -0.469192 -0.551067 -0.528638 -0.320212 -0.530161 -0.156744 -0.434978 -0.578417 -0.424490 0.025444 0.386056 0.112613 -0.396119 -0.408185 -0.175853 -0.352511 -0.224818 0.391948 -0.245546 -0.364465 -0.373604 0.333326 -0.365070 -0.300015 -0.737091 0.219853 0.235116 0.214389 0.235403 0.225834 0.216199 0.247718 0.243343 0.183414 0.239509 0.194203 0.238982 0.281248 0.232791 0.236517 0.292272 0.285619 0.343569 0.227015 0.235137 0.284691 0.275372 0.273946 0.282725
chargesum: 0.00000
title: Mulliken charges with hydrogens summed into heavy atoms:
elementType: S O O O O N N C C C C C C C C C C C C C C C C C C C C
charge: 0.963222 -0.220298 -0.125623 -0.551067 -0.528638 -0.076868 -0.245469 0.063109 0.014527 -0.117180 0.039426 0.025444 0.386056 0.112613 0.026803 -0.169203 0.018350 -0.071263 0.007973 0.391948 -0.009028 -0.072193 -0.087985 0.333326 -0.138055 -0.064878 0.094953
polarizability: 4.06647516e+02 3.84745054e+01 3.28842722e+02 -9.15851033e+00 -3.01491765e+00 1.63604786e+02
1716.lowfreq: -5.6341 -3.3971 -0.0016 -0.0013 -0.0004 2.7522 7.1596 10.5282 15.5624
frequency: 6.8558 10.3619 15.2226 19.6264 26.0783 40.6445 51.7569 68.5281 76.6100 104.9815 117.5025 141.5346 146.7357 156.9327 161.0474 163.6941 180.6381 185.8079 206.4488 215.2720 249.2056 252.8751 273.9219 287.4198 307.7064 322.7320 339.3045 346.0235 354.1681 386.0888 397.9197 406.0669 414.9105 430.0144 442.1104 473.7002 490.1283 496.3710 532.0370 539.3023 572.2468 584.8895 606.9926 613.9333 632.8344 664.4850 698.8850 714.8103 722.3209 750.2166 753.4882 783.7833 802.9438 814.6885 825.5346 839.7882 840.5978 855.7221 877.3801 889.6658 907.6458 908.6338 935.2283 965.5394 973.9835 978.4214 979.4615 988.1944 1001.5669 1004.4943 1007.1515 1011.7595 1020.2489 1027.9021 1036.9304 1044.3899 1070.4373 1094.5904 1103.7754 1112.6699 1127.5691 1137.1724 1148.8694 1152.2535 1172.3064 1175.6729 1182.9997 1205.5952 1207.8981 1215.6845 1216.4553 1230.5143 1236.8418 1252.3524 1263.5587 1285.9847 1296.1139 1301.3849 1308.6030 1314.3795 1330.6304 1334.9790 1353.8670 1368.3870 1385.1357 1387.2854 1392.3282 1414.0429 1416.0244 1421.7695 1440.7332 1450.7098 1451.4652 1471.6416 1473.1597 1477.9957 1487.9423 1491.2817 1566.3170 1567.2160 1584.9541 1610.4958 1616.6344 2837.2227 2885.6541 2905.6812 2935.2571 2954.0408 2988.3310 3016.9061 3034.2958 3034.5362 3037.4336 3062.6441 3115.2496 3121.1617 3135.6118 3137.5181 3150.6791 3152.5622 3166.4071 3184.8820 3185.6825 3193.2330 3314.3511 3398.8636 3566.2357
redmass: 4.7715 6.7636 5.6881 5.2419 5.2343 5.9536 4.9878 5.2271 4.3289 5.8984 4.0430 4.3916 3.2504 2.7683 1.7649 2.0335 4.5961 3.2061 4.8964 4.5476 3.9911 2.1609 1.1782 4.1180 6.9184 5.7732 4.4332 3.5265 4.8652 6.8553 4.2681 3.5775 3.5135 3.9582 3.2876 4.6188 3.6648 4.0102 4.4614 4.3057 3.5210 6.7059 3.3689 3.4243 6.7495 4.1679 1.5625 3.5087 2.9642 3.3988 1.5724 2.2952 11.1165 2.9548 4.9423 1.3091 2.2495 1.6759 2.1006 1.3911 2.0496 1.5921 1.7543 1.9282 3.1407 1.3559 1.4146 1.6389 1.4057 1.8138 1.5561 2.5682 1.8218 2.5768 2.2422 3.3244 2.5940 2.0471 1.6805 1.3824 2.0778 3.2029 1.4949 1.3690 1.1415 1.2860 1.2449 2.0657 1.4569 1.4305 1.5010 1.9749 2.2845 1.2839 1.3685 1.2556 1.2703 1.4645 1.1603 1.2966 1.4912 1.5179 1.6393 1.6436 1.5584 6.3556 3.9855 1.0529 1.0583 3.1654 2.3581 1.2081 1.1936 1.1302 1.3347 1.5755 1.3977 1.6093 9.1450 6.5249 7.1823 6.0628 6.9961 1.0717 1.0815 1.0794 1.0652 1.0670 1.0636 1.0953 1.0888 1.0921 1.0248 1.0994 1.0883 1.0872 1.0969 1.0891 1.0936 1.0898 1.1003 1.0951 1.1074 1.1071 1.0741 1.0736 1.0660
irintensity: 1.2120 1.6693 3.8056 2.7259 0.9010 0.9213 0.8462 2.6296 4.6006 8.0394 0.8002 9.8391 0.1754 3.0991 1.2225 5.5720 17.5847 1.0408 11.7431 12.7563 0.7293 1.8887 114.0260 47.6974 14.9190 22.7599 44.9606 12.1192 8.5227 9.0019 1.9085 4.7153 18.1795 1.2701 3.3302 4.0557 2.7949 3.6073 2.8706 16.0892 52.8295 39.3102 5.0674 6.6110 1.5433 5.3907 47.6352 7.5382 9.4690 4.1754 57.3270 13.5193 59.3943 11.7900 10.1338 16.8900 1.7856 49.8107 102.7126 0.9566 26.6489 21.5387 40.7973 13.8048 70.1960 27.7645 5.5876 5.8867 0.9743 7.9941 2.5254 7.6012 27.7258 2.0714 1.2202 52.2388 0.6404 5.4388 0.6031 1.9907 5.9272 109.1243 54.0370 6.4171 14.4494 9.2936 9.7262 0.4793 5.4591 27.4823 8.5226 78.1760 28.9517 1.2334 1.4762 18.8193 14.8477 30.0538 7.0627 2.0208 3.0450 18.1469 8.9519 52.5140 13.9633 4.1226 5.0257 11.2078 12.8817 12.1197 31.8553 22.6298 20.4671 2.7439 3.3438 18.4562 9.1504 18.4714 107.5411 1.2608 66.3043 48.9456 35.6754 161.5607 50.7010 14.9237 45.8119 15.7083 27.4391 25.4087 10.6440 40.3708 0.4278 38.7490 8.8846 4.9083 12.0430 11.2462 9.8759 6.9924 33.0805 2.2953 0.4940 0.7248 11.8065 1.1474 7.1686
temp: 298.150 k
press: 1.00000 atm
elementType: 16 8 8 8 8 7 7 6 6 6 6 6 6 6 6 6 6 6 6 6 6 6 6 6 6 6 6 1 1 1 1 1 1 1 1 1 1 1 1 1 1 1 1 1 1 1 1 1 1 1 1
symmnumber: 1
zpe: 1060478.5 jmol-1
zpe.correction: 0.403915 hartree
zpe.thermalcorrener: 0.431315 hartree
zpe.thermalcorrenthalpy: 0.432259 hartree
zpe.thermalcorrgfe: 0.340014 hartree
zpe.sumelectzpe: -1582.807446 hartree
zpe.sumelectthermal: -1582.780045 hartree
zpe.sumelectthermalent: -1582.779101 hartree
zpe.sumelectthermalfe: -1582.871347 hartree
dipole: 2.4554 0.4289 -0.8614
dipole: 2.6372
quadrupole: -157.0213 -165.1009 -172.3574
quadrupole: -23.4897 22.5944 12.6486
quadrupole: 7.8052 -0.2744 -7.5309 -23.4897 22.5944 12.6486
hfenergy: -1583.2113605 hartree
pointgroup: C01 [X(C20H24N2O4S1)]
dipole: 0.9647758 0.187122 -0.3327633 debye
polarizability: 393.3432656|50.971731|314.3655313|-2.9778772|-63.346291|191.3862267 unknown
InChI: InChI=1S/C20H24N2O4S/c1-27(25,26)22-17-10-8-15(9-11-17)19(23)13-21-12-16-7-6-14-4-2-3-5-18(14)20(16)24/h2-5,8-11,16,19,21-23H,6-7,12-13H2,1H3
charge 0 multiplicity 1
51 atoms
S  -6.00307 -2.694407 0.924568
O  4.70745 2.331936 -0.721689
O  -2.712231 3.662092 -1.224722
O  -5.539846 -4.091516 1.63867
O  -6.21987 -1.330136 1.789774
N  0.511709 2.073751 -0.112806
N  -4.771975 -2.341222 -0.685599
C  2.808036 1.260369 0.399951
C  2.434211 -0.225625 0.617647
C  3.301672 -0.849013 1.728838
C  1.901414 1.974899 -0.62461
C  4.297859 1.403209 0.038332
C  4.787922 -0.660861 1.460018
C  5.248861 0.417236 0.644928
C  -0.450408 2.653765 -1.072391
C  5.742384 -1.54869 2.012899
C  -1.892036 2.683805 -0.489947
C  6.64048 0.584315 0.404165
C  7.122555 -1.374727 1.774228
C  -2.634888 1.351468 -0.548046
C  7.576139 -0.302342 0.96531
C  -1.964347 0.136011 -0.246074
C  -4.017712 1.316993 -0.866945
C  -4.047947 -1.12281 -0.590629
C  -2.663939 -1.083159 -0.248512
C  -4.715714 0.0968 -0.893795
C  -7.612718 -3.038108 -0.028532
H  2.692873 1.775986 1.38435
H  1.362403 -0.289007 0.876142
H  2.58017 -0.781213 -0.330503
H  3.074739 -1.924857 1.846692
H  3.042943 -0.370547 2.697994
H  1.87905 1.387409 -1.563254
H  2.346628 2.962824 -0.877144
H  0.486947 2.577846 0.787523
H  -0.179309 3.701708 -1.36582
H  -0.437348 2.05085 -1.999153
H  -1.815487 3.001093 0.579229
H  5.398443 -2.38626 2.631821
H  6.953228 1.423153 -0.226552
H  7.843981 -2.074567 2.211056
H  8.646893 -0.167954 0.778919
H  -0.896849 0.175814 -0.002121
H  -4.523637 2.254455 -1.109272
H  -2.271176 4.547799 -1.183954
H  -2.143649 -2.015862 0.005652
H  -5.77685 0.069306 -1.161764
H  -4.143487 -3.164409 -0.562654
H  -7.404461 -3.886073 -0.69361
H  -7.842621 -2.120307 -0.584509
H  -8.368217 -3.272719 0.7343
