program: Gaussian 09
title: 000195402
version: EM64L-G09RevD.01
frameworkgroup: C1[X(C10H8BrNO3)]
method: RPBEPBE
basis: SDD
operation: Freq
keyword: #p
keyword: freq=noraman
keyword: PBEPBE/SDD
title: #p freq=noraman PBEPBE/SDD
converged: NO YES NO NO
title: Mulliken charges:
elementType: Br O O O N C C C C C C C C C C H H H H H H H H
charge: 0.017009 -0.241550 -0.248680 -0.172159 0.063490 0.014083 0.307879 -0.481462 -0.299632 0.352866 0.102018 -0.345900 0.108458 -0.782220 -0.535584 0.280835 0.273069 0.265510 0.302020 0.302197 0.231549 0.231574 0.254632
chargesum: 0.00000
title: Mulliken charges with hydrogens summed into heavy atoms:
elementType: Br O O O N C C C C C C C C C C
charge: 0.017009 -0.241550 -0.248680 -0.172159 0.063490 0.014083 0.307879 -0.200628 -0.026562 0.352866 0.102018 -0.080391 0.108458 -0.178002 0.182171
polarizability: 2.51367722e+02 2.25658112e+01 1.55066448e+02 3.35146622e-02 5.70915704e-03 6.01055401e+01
1716.lowfreq: -14.1512 -4.8542 -0.0008 -0.0008 -0.0008 5.5977 7.2718 56.4002 80.5201
frequency: -13.8637 56.3897 80.5181 93.9702 118.7949 156.7235 195.9884 217.9571 230.5633 261.7739 301.4997 348.2247 385.8628 436.1970 458.2336 463.4231 465.7101 539.7655 568.5748 607.2691 622.6445 670.7707 687.5374 715.6034 746.0229 769.8014 831.7868 851.4616 851.7095 859.2532 925.7088 955.7738 970.5626 988.8491 1097.5233 1112.8748 1117.9905 1140.1303 1156.0296 1170.8853 1222.8328 1264.1507 1269.4893 1283.4583 1387.6714 1422.9787 1431.3453 1447.0559 1469.2468 1470.3905 1481.4452 1537.1017 1559.4909 1614.2477 1656.0198 2972.9822 3040.3708 3067.1007 3105.8171 3138.5307 3166.9730 3184.0439 3187.3931
redmass: 4.7565 3.3558 12.7840 7.8190 3.5901 4.9074 1.8472 10.1005 2.2943 3.1431 5.6949 4.4254 7.7215 8.8748 8.6790 3.0757 5.4938 5.9157 9.0673 6.7005 4.3373 6.6220 3.8336 7.5915 3.5792 7.9102 1.4968 1.6501 7.7832 1.7297 5.4907 8.6959 1.3287 3.7647 2.1887 1.2590 1.9792 1.1005 1.3802 2.0195 2.4306 1.7944 2.0066 3.3031 5.9854 1.1628 1.4627 2.7489 1.0493 1.1619 2.6065 7.4054 8.4095 7.8720 10.9534 1.0324 1.0575 1.1046 1.1057 1.1005 1.0888 1.0923 1.0977
irintensity: 0.9173 7.3176 0.6687 0.6722 1.2777 1.3311 5.5754 5.8041 3.9782 0.2275 0.7046 1.8514 3.3999 8.5821 13.7518 1.4544 18.6441 11.6922 29.1924 0.6416 1.7841 43.0211 18.1378 1.7080 3.0062 2.4333 19.5282 69.4368 21.3217 1.0426 16.2646 25.3381 0.0987 70.1025 76.9780 0.1112 18.0055 1.3098 0.3820 141.2167 27.3175 33.0665 57.4425 179.8156 8.7723 6.8010 3.5233 41.1377 16.1222 65.2300 16.5424 146.8920 17.1937 584.4121 179.6923 55.0096 4.2711 37.0295 0.5814 18.9158 0.5004 0.9550 3.6492
temp: 298.150 k
press: 1.00000 atm
elementType: 35 8 8 8 7 6 6 6 6 6 6 6 6 6 6 1 1 1 1 1 1 1 1
symmnumber: 1
zpe: 422344.6 jmol-1
zpe.correction: 0.160863 hartree
zpe.thermalcorrener: 0.173480 hartree
zpe.thermalcorrenthalpy: 0.174424 hartree
zpe.thermalcorrgfe: 0.120533 hartree
zpe.sumelectzpe: -678.650393 hartree
zpe.sumelectthermal: -678.637776 hartree
zpe.sumelectthermalent: -678.636832 hartree
zpe.sumelectthermalfe: -678.690722 hartree
dipole: -5.3421 -0.5813 0.0147
dipole: 5.3736
quadrupole: -76.4810 -104.7780 -96.0577
quadrupole: -3.3246 0.0161 0.0304
quadrupole: 15.9579 -12.3391 -3.6188 -3.3246 0.0161 0.0304
hfenergy: -678.8112557 hartree
pointgroup: C01 [X(C10H8Br1N1O3)]
dipole: 2.0764601 0.3687673 0.1480003 debye
dipolederiv: -0.1841111 -0.0945956 0.0028898 -0.3008983 -0.3130208 -0.0045469 0.0266143 0.0150146 -0.1020882 -1.0924383 0.3512131 -0.1209078 -0.0169052 -0.4303182 0.0235593 -0.0831891 0.0574918 -0.2174397 -1.9567387 -0.5030011 -0.1007129 -0.5806124 -0.5093246 -0.030519 -0.0924875 -0.0233535 -0.2986523 -1.0208382 0.3098919 -0.0994919 0.7993911 -0.9037718 0.138899 -0.1484132 0.0885406 -0.3570963 0.7661003 -0.1505411 0.106553 0.0114608 -0.0933696 -0.0094632 0.0874058 -0.0248821 -0.1742243 -0.7840825 0.0500317 -0.0800811 -0.4215173 -0.1455497 -0.0230153 -0.0278422 0.0218239 0.0024302 0.8308106 -0.1651519 0.0793489 0.1970555 0.372445 -0.0027278 0.0392229 -0.0370035 0.1846111 -0.7841501 0.003656 -0.0519246 0.276882 -0.0712163 0.0079087 -0.0823169 -0.0174689 -0.2411885 0.5637534 -0.0283772 0.065498 -0.1764944 0.1560075 -0.0445976 0.0820973 -0.030996 -0.0881541 1.8496545 0.3885336 0.118066 0.3490491 0.2577108 0.0194352 0.1226723 0.023071 0.1425469 0.4408538 0.2044409 0.0164834 0.8049581 -0.3918145 0.1216543 -0.0475763 0.0657051 0.0112635 -0.5416713 -0.1149432 -0.0207885 -0.6197399 -0.1068918 -0.0668672 0.0348263 -0.0192772 -0.1796095 1.2520273 -0.5104387 0.1421513 -1.1871267 1.0892969 -0.1950278 0.2146838 -0.1274303 0.3714709 -0.11125 0.1452437 -0.0334653 0.6190535 0.6107689 -0.0027772 -0.0883587 -0.0469615 0.0686916 0.5423556 0.1656786 0.0031004 0.6597692 0.5379495 0.0371044 -0.0516513 -0.0093803 0.3101043 0.0763938 -0.0328301 -0.0065855 -0.0612081 0.0006807 0.0144768 -0.0032525 0.0170875 0.1825442 0.0917538 -0.0587224 0.000222 -0.0143249 -0.0060696 0.0166357 -0.0046362 0.0125029 0.1558478 0.0189893 0.0691505 -0.022346 0.0614148 0.0433178 0.020307 -0.0214758 0.021039 0.1714197 0.0243501 -0.0589135 -0.0210856 -0.0867062 -0.0372417 0.0752035 -0.0336028 0.0391944 0.0162777 0.0130081 -0.046536 0.0296453 -0.0629961 -0.0621716 -0.0700338 0.0473708 -0.0299856 0.05427 0.06566 0.0722256 0.0985501 -0.1198776 -0.0596971 -0.0813118 0.0514945 -0.0867145 -0.0409694 0.0874903 0.0349903 -0.0826907 -0.1380564 -0.0246855 0.0504165 0.0050629 0.0902857 -0.0977272 -0.1479209 -0.0310051 -0.0224285 0.0074293 0.0869659 0.0052871 -0.0266483 0.0016969 0.1256715 unknown
polarizability: 254.3715613|7.8422421|149.4227496|17.3734553|-9.1305812|62.7453992 unknown
InChI: InChI=1S/C10H8BrNO3/c1-14-6-2-3-7-9(4-6)15-10(13)8(5-11)12-7/h2-4H,5H2,1H3
charge 0 multiplicity 1
23 atoms
Br -4.288869 -2.408853 -0.221639
O  -0.522866 1.516661 -0.303215
O  4.078884 0.00037 0.295866
O  -2.723409 2.161341 -0.578494
N  -1.399125 -1.191452 -0.089594
C  -0.043073 -0.861515 0.002634
C  0.409714 0.487477 -0.102318
C  1.766477 0.84057 -0.013288
C  0.930941 -1.880481 0.206481
C  2.70646 -0.198098 0.189072
C  -2.285074 -0.226901 -0.27938
C  2.286628 -1.559354 0.299101
C  -1.932324 1.214414 -0.405611
C  -3.772531 -0.483208 -0.390948
C  4.589647 1.374718 0.191038
H  2.049055 1.891899 -0.102154
H  0.579349 -2.912952 0.286652
H  3.049901 -2.325905 0.455137
H  -4.15689 -0.144964 -1.367357
H  -4.323688 0.055314 0.397551
H  4.180945 2.011958 0.997665
H  4.348545 1.812586 -0.795823
H  5.678804 1.281376 0.303324
