program: Gaussian 09
title: 000195490
version: EM64L-G09RevD.01
frameworkgroup: C1[X(C14H17N2O11P)]
method: RPBEPBE
basis: SDD
operation: Freq
keyword: #p
keyword: freq=noraman
keyword: PBEPBE/SDD
title: #p freq=noraman PBEPBE/SDD
converged: YES YES NO NO
title: Mulliken charges:
elementType: P O O O O O O O O O O O N N C C C C C C C C C C C C C C H H H H H H H H H H H H H H H H H
charge: 1.381115 -0.415755 -0.429667 -0.211572 -0.211654 -0.406801 -0.463253 -0.222982 -0.549102 -0.683871 -0.669843 -0.578170 -0.323997 0.008269 0.156535 -0.311305 -0.583962 -0.207682 0.284339 0.122252 0.155983 0.143727 0.254155 0.051768 -0.402441 0.000866 -0.527557 -0.826114 0.304437 0.287735 0.280250 0.275189 0.354181 0.312881 0.239846 0.300347 0.391517 0.393401 0.384971 0.387127 0.238743 0.230939 0.282534 0.404207 0.398415
chargesum: 0.00000
title: Mulliken charges with hydrogens summed into heavy atoms:
elementType: P O O O O O O O O O O O N N C C C C C C C C C C C C C C
charge: 1.381115 -0.024238 -0.036266 -0.211572 -0.211654 -0.021831 -0.076126 -0.222982 -0.549102 -0.279665 -0.271428 -0.578170 0.030183 0.008269 0.156535 -0.006867 -0.015977 0.067507 0.284339 0.122252 0.155983 0.143727 0.254155 0.051768 0.150285 0.000866 -0.227209 -0.073899
polarizability: 2.69697003e+02 -4.04778144e+00 2.40368579e+02 8.48860353e+00 3.60744688e+00 1.65347891e+02
1716.lowfreq: -4.4525 -2.4028 -0.0011 -0.0009 -0.0005 4.7245 16.0066 19.9731 27.1319
frequency: 15.9756 19.4819 27.0747 37.7196 45.9281 49.6873 55.0285 61.4275 65.5701 73.1859 83.6379 119.9667 124.0995 126.7030 143.3576 150.8934 157.6238 166.6475 177.1166 177.8031 219.4209 238.8475 242.4599 269.6221 275.1659 297.5040 303.2965 307.3440 316.2200 328.1886 338.9858 349.3743 360.4083 371.6784 371.7224 385.7443 401.6404 440.6099 471.5650 496.9278 522.0468 549.9083 556.3339 570.9713 571.9936 577.5537 595.1472 608.5060 618.3817 620.6782 636.5194 649.5566 663.1100 684.8919 706.7395 709.9130 722.6248 731.9140 744.3530 765.6967 776.8536 790.5396 832.1149 875.8347 913.6822 929.2338 930.0234 942.3370 978.3348 987.9729 998.3051 1004.6797 1013.7108 1024.2150 1030.2026 1042.9443 1049.2403 1056.4222 1065.9829 1093.9694 1116.1561 1137.8602 1152.0533 1176.5843 1205.9813 1222.8424 1237.3536 1244.6511 1249.2472 1268.4144 1272.5817 1281.6126 1287.2270 1305.0676 1311.1870 1321.9122 1343.6604 1372.7153 1382.1645 1388.1834 1405.6323 1450.0220 1462.4227 1464.3122 1474.5745 1477.5834 1497.2219 1549.0766 1592.5887 1635.6027 1655.9247 1665.1660 2959.0417 2981.5901 3013.9365 3032.6943 3040.9708 3056.5819 3078.7140 3115.2574 3118.8087 3185.9615 3411.6725 3513.6911 3520.7984 3522.5407 3584.9653 3591.2227 3606.3628
redmass: 6.6382 8.7379 6.2482 7.3643 9.0923 9.8545 9.1904 7.0927 6.4917 8.5150 5.2751 6.1442 3.7622 3.0234 4.1736 5.5172 4.9191 1.1836 2.4635 3.5675 5.9097 3.5801 4.4419 3.9861 4.2492 2.6432 1.8116 4.1633 5.7986 5.0735 2.3609 3.9464 4.2805 2.2280 4.6232 5.3202 7.5348 5.9291 4.8067 4.7034 4.4647 2.5112 2.9528 3.0505 2.8410 2.7886 4.9189 1.5835 1.8332 3.4805 2.5913 6.4148 5.0961 3.9479 4.3783 5.0780 9.7259 5.9026 3.6585 6.7081 2.1548 5.6505 4.4784 3.9286 1.3610 3.4724 3.0500 3.0008 3.2325 4.4524 1.8307 1.3470 3.5589 1.3144 3.0047 1.5378 3.3562 2.1075 2.2488 6.7453 3.7857 2.4828 3.2217 1.7899 1.4713 2.9448 1.0929 1.4246 4.8850 1.4728 1.6848 1.7275 1.8755 1.5721 3.0045 1.3655 1.7524 1.8797 1.5051 1.3794 2.5746 1.5920 1.0896 1.1018 1.5430 1.0819 1.2111 6.0673 6.8112 9.4124 9.5671 8.5495 1.0408 1.0635 1.0851 1.0973 1.0596 1.0855 1.0985 1.0945 1.1058 1.0918 1.0743 1.0641 1.0642 1.0641 1.0657 1.0662 1.0664
irintensity: 2.9710 0.2458 0.6084 1.1218 0.3338 1.4572 0.9293 0.5470 0.6102 1.7029 0.5864 3.6895 1.4292 5.1299 25.2348 8.7524 2.3758 2.1704 35.0401 15.4638 5.1365 12.8885 16.1268 7.7886 20.9374 26.4455 40.4478 10.4217 0.2640 8.7833 15.2114 66.5509 3.3362 178.9548 19.7902 5.2583 15.7702 35.7180 20.6175 2.1116 2.4119 23.6894 36.0231 51.0469 37.0606 23.3560 45.4901 20.8420 123.7100 23.9390 59.8012 22.8588 27.2143 81.7825 46.9953 6.8362 220.0929 16.1300 100.3548 149.8906 103.5927 22.7171 31.8242 16.3389 17.2163 134.4317 26.4462 37.1510 48.1007 59.4231 5.6402 24.2351 335.0377 197.2397 59.3247 4.5494 64.6684 208.4360 124.3627 243.1420 18.3121 36.2273 55.6319 176.6634 9.0643 4.6727 10.4624 0.8970 3.2977 29.1375 20.9413 7.4249 6.1663 42.3469 1.3491 25.4038 42.7753 29.0423 22.7025 54.1169 51.8231 32.1839 34.8038 22.9000 12.0441 19.7676 45.6177 2.8537 2.5003 183.0402 253.4864 204.8729 22.1113 12.3870 25.5235 17.3136 2.7104 9.5755 2.7627 3.4495 2.0337 1.2168 47.5815 35.4784 42.4158 41.6106 57.9026 71.9301 65.8985
temp: 298.150 k
press: 1.00000 atm
elementType: 15 8 8 8 8 8 8 8 8 8 8 8 7 7 6 6 6 6 6 6 6 6 6 6 6 6 6 6 1 1 1 1 1 1 1 1 1 1 1 1 1 1 1 1 1
symmnumber: 1
zpe: 835899.5 jmol-1
zpe.correction: 0.318377 hartree
zpe.thermalcorrener: 0.347929 hartree
zpe.thermalcorrenthalpy: 0.348873 hartree
zpe.thermalcorrgfe: 0.255197 hartree
zpe.sumelectzpe: -1819.767857 hartree
zpe.sumelectthermal: -1819.738305 hartree
zpe.sumelectthermalent: -1819.737361 hartree
zpe.sumelectthermalfe: -1819.831037 hartree
dipole: -1.6329 -2.2582 -1.3726
dipole: 3.1064
quadrupole: -173.3069 -160.7636 -168.4280
quadrupole: -21.0417 -5.5546 5.3265
quadrupole: -5.8074 6.7359 -0.9285 -21.0417 -5.5546 5.3265
hfenergy: -1820.0862342 hartree
pointgroup: C01 [X(C14H17N2O11P1)]
dipole: 0.6447339 0.8964907 -0.5237328 debye
polarizability: 269.5122257|-4.0586185|240.5502957|-9.3551879|-1.7543909|165.3509514 unknown
InChI: InChI=1S/C14H17N2O11P/c1-5-9(17)8(6(3-15-5)4-27-28(24,25)26)10-14(12(20)21,13(22)23)2-7(16-10)11(18)19/h3,7,10,16-18,20,22,24-25H,2,4H2,1H3
charge 0 multiplicity 1
45 atoms
P  -4.993734 0.832928 -0.501631
O  -0.147804 0.357007 2.639911
O  -0.583061 2.670917 0.73167
O  1.925933 -0.677159 2.490485
O  1.290921 3.367576 1.890845
O  4.922681 2.330366 -1.651081
O  2.146291 -2.017757 -0.349792
O  4.514958 0.088978 -2.118429
O  -3.716561 -0.239921 -0.177484
O  -4.427407 2.234853 0.313361
O  -4.77902 1.380578 -2.1346
O  -6.423613 0.252546 -0.166954
N  1.766535 0.475171 -1.496827
N  -1.248866 -3.447786 0.056454
C  1.314039 1.11053 0.875849
C  0.671118 0.462405 -0.509327
C  2.810193 1.2868 0.52153
C  2.769751 1.459158 -1.037419
C  0.001022 -0.899382 -0.336075
C  1.116347 0.172457 2.066984
C  0.707425 2.482076 1.231023
C  4.122456 1.186496 -1.667396
C  -1.416708 -1.022542 -0.244482
C  0.747978 -2.1029 -0.236065
C  -2.303117 0.20367 -0.348352
C  0.106315 -3.358314 -0.041165
C  -1.984154 -2.30283 -0.04784
C  0.911603 -4.63637 0.070554
H  -0.093917 1.192618 -0.814007
H  3.260431 2.14313 1.046723
H  3.347977 0.358611 0.779018
H  2.465508 2.491989 -1.289769
H  2.212788 -0.44896 -1.608667
H  -2.072449 0.94407 0.435009
H  -2.201304 0.6912 -1.338848
H  -3.067341 -2.408944 0.030978
H  -0.276944 -0.288436 3.386378
H  -0.938313 3.54582 1.04584
H  5.820148 2.116698 -2.025824
H  2.582979 -2.872696 -0.113184
H  1.496988 -4.843444 -0.84721
H  1.611092 -4.621309 0.931499
H  0.213276 -5.472667 0.224491
H  -4.98749 3.043028 0.198413
H  -5.328856 0.89174 -2.799287
