program: Gaussian 09
title: 000195455
version: EM64L-G09RevD.01
frameworkgroup: C1[X(C25H24FNO4)]
method: RPBEPBE
basis: SDD
operation: Freq
keyword: #p
keyword: freq=noraman
keyword: PBEPBE/SDD
title: #p freq=noraman PBEPBE/SDD
converged: YES YES NO NO
title: Mulliken charges:
elementType: F O O O O N C C C C C C C C C C C C C C C C C C C C C C C C C H H H H H H H H H H H H H H H H H H H H H H H H
charge: -0.205180 -0.232285 -0.440086 -0.277370 -0.207166 -0.252018 -0.191798 -0.409883 -0.120718 0.130096 -0.034945 0.108641 -0.560318 0.289762 -0.088842 -0.386638 0.114213 0.034200 0.181965 0.246278 -0.701394 -0.695073 -0.366490 -0.361784 -0.243907 -0.243112 -0.346119 -0.372593 -0.379444 -0.382280 0.308009 0.247308 0.223007 0.253539 0.255697 0.247306 0.279839 0.258030 0.280651 0.253535 0.216358 0.274368 0.218834 0.204062 0.215333 0.277733 0.251584 0.278590 0.349165 0.229787 0.235305 0.250066 0.264466 0.260440 0.261276
chargesum: 0.00000
title: Mulliken charges with hydrogens summed into heavy atoms:
elementType: F O O O O N C C C C C C C C C C C C C C C C C C C C C C C C C
charge: -0.205180 -0.232285 -0.090920 -0.277370 -0.207166 -0.252018 0.055511 0.066662 0.134979 0.130096 0.212362 0.108641 -0.022450 0.289762 0.191809 -0.133103 0.114213 0.034200 0.181965 0.246278 0.008166 0.002055 -0.114906 -0.083194 -0.014120 -0.007807 -0.096053 -0.108127 -0.119004 -0.121004 0.308009
polarizability: 3.95423626e+02 3.54898610e+00 3.24839384e+02 2.77896655e+00 -9.91639649e+00 2.00418769e+02
1716.lowfreq: -8.0171 -3.5982 0.0001 0.0004 0.0005 3.3373 13.3852 18.9782 28.4232
frequency: 12.8644 18.8398 28.3397 35.1952 40.1811 46.8416 50.3290 64.0844 79.3699 82.2164 99.5473 116.6341 127.7652 151.5288 173.9588 176.2219 177.4914 200.7152 217.6342 231.0338 238.8680 249.1151 260.1101 277.9566 308.2192 316.8515 340.7902 360.4282 361.2255 377.2431 381.8117 405.2943 409.0054 420.5735 437.9687 448.0710 454.0994 461.7336 488.9079 496.0898 501.6398 519.4712 530.5051 536.1836 549.7570 567.0247 602.9517 623.2463 656.6541 666.4211 688.2860 692.6087 713.5667 726.2066 747.9073 773.4431 783.6135 796.2059 803.3097 812.1959 823.2161 834.0256 839.2309 860.5036 873.0053 890.6401 895.3488 904.8810 924.0779 930.1007 941.9844 946.7298 953.9732 966.3908 982.9279 983.4685 995.1418 1005.3862 1006.0403 1027.6872 1032.3775 1038.8484 1075.2257 1098.4041 1105.2620 1111.7734 1115.5571 1136.8072 1146.5643 1154.7328 1164.4410 1170.0746 1173.2750 1181.7107 1189.0122 1195.6605 1210.0357 1229.1943 1246.4525 1256.9773 1271.1198 1278.3636 1288.4228 1290.6990 1299.4878 1311.0514 1323.2002 1325.0683 1336.5100 1346.4565 1355.8065 1362.6713 1371.7742 1376.6420 1386.7952 1391.0772 1397.3415 1401.5853 1427.9743 1437.3165 1443.5779 1454.0756 1466.6564 1476.0221 1482.8855 1493.2801 1499.4578 1544.6291 1559.7732 1590.2086 1600.0644 1608.6948 1614.9675 1657.1738 1672.2579 2986.0760 2993.5862 2999.5334 3003.7857 3008.5008 3032.0881 3062.0741 3070.2991 3074.7006 3075.9282 3079.1119 3082.6431 3116.7465 3128.1586 3131.8735 3132.9151 3140.7918 3144.3876 3148.2982 3161.3060 3171.0386 3172.4498 3175.4293 3555.3744
redmass: 6.3190 6.0515 6.8681 5.8915 4.3828 5.1145 4.5532 4.2692 4.5451 3.7994 5.5156 6.0381 4.8269 4.8825 5.4205 2.3560 4.5702 2.5380 1.5835 1.6333 2.0396 2.8482 1.4770 3.6408 2.4178 6.1766 3.3567 2.4951 5.2792 6.5746 4.2824 3.9814 3.0495 3.2655 4.1012 5.0202 4.8831 4.4346 3.6201 3.9022 4.1321 3.0653 7.1470 3.7987 5.7545 4.1947 4.8034 6.7549 5.7484 4.3912 5.0838 3.8936 4.8447 4.4590 5.7633 3.3311 1.8717 3.0318 5.2261 3.3385 1.2550 2.0588 2.2550 3.6979 2.6629 2.2279 1.4639 2.8039 1.3178 2.5991 2.7384 1.4424 1.6851 1.3519 1.2810 1.2542 2.5283 2.9206 1.3428 3.1848 2.3527 2.5288 2.3069 1.3264 2.1743 1.9443 2.2566 2.6379 2.4988 1.5012 1.9539 1.3486 1.2026 2.0684 1.4552 2.0205 2.1835 1.4375 3.4695 1.5190 1.6063 1.8532 1.2782 1.3894 2.1890 1.3987 1.4843 1.4228 1.5478 2.8828 3.0934 1.7601 1.2128 1.2302 1.2929 1.4872 3.5516 8.0278 1.0752 2.5426 1.0907 1.0431 1.0760 2.6971 1.0504 2.9513 1.0813 7.0312 7.3569 7.8471 8.4791 6.7606 6.4938 11.7964 6.9033 1.0369 1.0376 1.0687 1.0671 1.0773 1.0834 1.0884 1.0893 1.0994 1.0966 1.0990 1.0990 1.0991 1.0989 1.0860 1.0910 1.0900 1.0897 1.0895 1.0943 1.0999 1.0958 1.0967 1.0666
irintensity: 0.5299 0.5240 1.3028 0.8190 0.7183 1.7703 1.9660 1.8745 4.2902 0.1965 0.7875 9.1498 3.7094 0.6293 0.5635 0.6819 0.1166 14.4453 0.6651 1.8098 43.1637 0.7907 80.3267 2.0025 8.9989 3.3530 2.5881 0.2630 5.3474 3.4535 0.8216 2.6559 0.1328 6.4947 0.8349 9.7242 10.1297 0.5759 4.2393 1.2471 0.6964 15.8156 26.3892 3.8487 0.5711 3.4824 5.6639 0.7547 0.7352 2.0517 1.2383 23.3111 4.4782 1.6855 1.8910 38.3656 47.8901 6.4283 13.3434 28.3014 2.1848 49.8136 29.1008 34.9378 1.2882 10.0273 0.1924 2.5937 6.2391 9.3887 92.6579 1.8704 6.3196 0.7019 37.4207 36.4709 203.5214 18.8022 0.9270 43.6501 14.2232 45.9511 16.3546 12.4159 166.1464 21.0921 19.1083 45.6181 6.5089 57.2108 32.4727 30.4986 14.1746 9.4909 98.7931 51.0828 5.5292 52.7470 40.9325 8.4275 15.1369 11.8533 2.6401 18.5778 44.7897 13.6085 28.5780 22.2876 9.3013 7.5205 4.2700 15.4456 35.7612 23.3587 36.1225 47.0320 3.1754 28.6601 13.8202 0.1779 16.0841 1.1774 55.7705 36.8051 2.9347 138.6286 13.0161 34.7952 98.1089 26.8978 196.2606 3.3277 33.1182 339.2636 3.0442 31.9254 25.3255 5.9202 0.7984 23.5977 14.9713 27.2100 19.2047 26.1104 10.0555 9.4619 48.1879 4.8566 10.8657 4.0861 6.5049 5.0561 6.8391 9.6918 8.2752 28.6841 3.0027 1.9876 10.9106
temp: 298.150 k
press: 1.00000 atm
elementType: 9 8 8 8 8 7 6 6 6 6 6 6 6 6 6 6 6 6 6 6 6 6 6 6 6 6 6 6 6 6 6 1 1 1 1 1 1 1 1 1 1 1 1 1 1 1 1 1 1 1 1 1 1 1 1
symmnumber: 1
zpe: 1132407.1 jmol-1
zpe.correction: 0.431311 hartree
zpe.thermalcorrener: 0.459983 hartree
zpe.thermalcorrenthalpy: 0.460927 hartree
zpe.thermalcorrgfe: 0.369240 hartree
zpe.sumelectzpe: -1420.328982 hartree
zpe.sumelectthermal: -1420.300310 hartree
zpe.sumelectthermalent: -1420.299366 hartree
zpe.sumelectthermalfe: -1420.391054 hartree
dipole: 0.3697 3.3149 1.4437
dipole: 3.6345
quadrupole: -194.8508 -192.3789 -184.6169
quadrupole: -3.5696 8.2729 -14.4059
quadrupole: -4.2352 -1.7634 5.9986 -3.5696 8.2729 -14.4059
hfenergy: -1420.7602936 hartree
pointgroup: C01 [X(C25H24F1N1O4)]
dipole: 0.0962499 1.3718946 -0.3915694 debye
polarizability: 391.7918287|-16.5384842|323.8527126|3.6859844|25.3924901|205.0372384 unknown
InChI: InChI=1S/C25H24FNO4/c1-15(2)27-22(12-11-19-13-18(28)14-23(29)31-19)24(16-7-9-17(26)10-8-16)20-5-3-4-6-21(20)25(27)30/h3-12,15,18-19,28H,13-14H2,1-2H3
charge 0 multiplicity 1
55 atoms
F  -1.242629 5.258627 0.561317
O  -3.807816 -1.261652 0.736128
O  -5.488844 0.433454 -1.732197
O  3.575023 -3.315755 -0.568823
O  -5.692459 -1.792767 1.896726
N  1.552108 -2.127305 -0.436669
C  -3.029383 -0.391828 -0.238378
C  -3.562391 1.049729 -0.280428
C  -5.094366 1.057628 -0.452387
C  0.853946 -0.906795 -0.27403
C  0.780986 -3.405881 -0.690781
C  1.514209 0.262637 0.112261
C  -5.751568 0.367757 0.754747
C  2.956422 0.229485 0.328964
C  -1.593337 -0.475054 0.194348
C  -0.596002 -0.924372 -0.611665
C  3.667221 -0.992248 0.098221
C  2.968788 -2.222144 -0.32618
C  -5.115379 -0.966432 1.164777
C  0.784918 1.569297 0.23064
C  1.041173 -4.460514 0.409166
C  1.033952 -3.940394 -2.117587
C  3.706941 1.38293 0.718759
C  5.075601 -1.051563 0.270326
C  5.098192 1.311021 0.886177
C  5.791508 0.088331 0.666159
C  0.357833 2.269766 -0.928501
C  0.537485 2.149871 1.502716
C  -0.32259 3.503567 -0.830994
C  -0.141076 3.383033 1.626332
C  -0.560337 4.028929 0.450643
H  -3.159999 -0.869553 -1.228425
H  -3.28478 1.595236 0.642342
H  -3.08586 1.568798 -1.129862
H  -5.460283 2.093513 -0.545457
H  -0.280838 -3.117694 -0.604796
H  -6.825346 0.184043 0.577224
H  -5.689281 1.027911 1.641884
H  -1.377371 -0.124394 1.211124
H  -0.85665 -1.298402 -1.614174
H  0.339965 -5.302478 0.264193
H  2.07154 -4.842175 0.362926
H  0.858499 -4.034921 1.412197
H  0.808845 -3.17164 -2.880008
H  0.380171 -4.811877 -2.304318
H  2.083274 -4.253498 -2.231382
H  3.187596 2.332375 0.879319
H  5.570935 -2.009216 0.080986
H  -5.551691 -0.550124 -1.62663
H  5.655552 2.205956 1.184867
H  6.877354 0.040861 0.799527
H  0.561632 1.842856 -1.916203
H  0.868842 1.625583 2.405716
H  -0.651765 4.051014 -1.71905
H  -0.340068 3.83477 2.602508
