program: Gaussian 09
title: 000195334
version: EM64L-G09RevD.01
frameworkgroup: C1[X(C13H14N2O3S)]
method: RPBEPBE
basis: SDD
operation: Freq
keyword: #p
keyword: freq=noraman
keyword: PBEPBE/SDD
title: #p freq=noraman PBEPBE/SDD
converged: YES YES NO NO
title: Mulliken charges:
elementType: S O O O N N C C C C C C C C C C C C C H H H H H H H H H H H H H H
charge: 0.159583 -0.418222 -0.231482 -0.444501 -0.257778 -0.407555 -0.510500 -0.502306 -0.165704 -0.752435 0.406581 0.152885 0.226636 -0.414801 0.227484 -0.606196 -0.315684 0.282570 -0.351118 0.292730 0.262641 0.223595 0.269804 0.292998 0.294634 0.271764 0.276113 0.304121 0.225087 0.228809 0.247745 0.384472 0.348030
chargesum: 0.00000
title: Mulliken charges with hydrogens summed into heavy atoms:
elementType: S O O O N N C C C C C C C C C C C C C
charge: 0.159583 -0.033750 -0.231482 -0.096471 0.035220 -0.103434 -0.217770 -0.016069 0.104100 -0.186036 0.406581 0.152885 0.226636 -0.138688 0.227484 -0.381109 -0.086875 0.282570 -0.103373
polarizability: 2.40439959e+02 4.63453186e+00 1.87514576e+02 -1.26578873e+01 -1.01865484e+01 1.13748620e+02
1716.lowfreq: -13.1120 -7.6201 -0.0002 0.0008 0.0010 3.1699 14.6965 30.3400 37.3135
frequency: 12.5458 30.2106 37.3075 47.0851 72.7302 97.6327 143.3623 156.1389 190.9036 218.1954 249.0228 283.9996 320.5894 327.7723 348.5924 361.5434 372.0376 420.4031 426.8470 443.3903 472.7621 490.7062 496.5308 532.0441 559.0090 583.2008 584.4431 594.2666 613.0877 648.3774 683.8919 689.5655 726.7430 748.2098 756.9685 773.7032 786.0909 798.3356 807.4151 824.9001 833.3133 899.9614 911.9630 923.6211 930.7237 935.1834 973.7145 1043.3753 1051.9018 1088.1715 1092.7564 1112.7288 1119.9429 1127.4388 1145.8002 1167.0496 1204.7731 1217.4055 1239.9542 1242.8255 1256.6102 1283.9150 1286.8440 1301.0585 1305.9131 1337.6314 1339.7467 1367.0875 1396.3886 1442.1253 1442.6438 1450.4474 1459.4656 1465.4167 1480.7653 1561.7872 1601.9382 1636.6023 1658.7204 2990.4966 3041.1524 3052.3821 3055.1759 3075.6064 3112.4498 3128.0852 3137.9707 3174.5659 3230.4686 3495.7533 3514.3578 3584.8382 3616.4059
redmass: 6.4033 6.7756 7.0896 8.1204 5.8070 4.1583 5.3901 6.2832 4.2035 4.4821 3.9055 3.9924 2.1676 1.5749 4.0622 8.5356 3.4871 2.8665 3.7721 5.4173 7.7415 3.8780 1.2308 2.4892 4.4338 1.8949 2.0026 2.9535 2.8141 3.7560 4.3739 3.8690 5.0115 4.3483 3.9479 3.8671 2.5960 1.6870 1.5416 3.7376 1.7453 2.1214 2.3929 3.7684 1.3349 2.4083 2.5972 2.5453 3.1608 1.8604 1.5338 1.3264 1.5487 1.8465 1.2865 1.8854 1.5676 1.3879 1.3366 2.2326 1.4594 1.3342 1.5058 1.8997 2.1886 1.8190 1.3428 1.3664 4.4310 2.4870 1.2995 1.1008 1.2402 2.9082 4.4031 6.1816 6.2203 7.2233 8.5685 1.0656 1.0861 1.0605 1.0852 1.0944 1.0911 1.1088 1.0896 1.0955 1.0986 1.0765 1.0640 1.0659 1.0809
irintensity: 0.2406 0.4069 1.1619 1.0706 0.9084 1.0666 4.2665 0.9764 1.5939 0.7515 2.8228 0.4865 34.8689 95.1494 16.5392 4.5603 6.1184 17.1016 4.2347 2.3763 26.5561 4.1406 104.6350 31.2434 30.4364 30.6729 20.5636 45.7421 121.0673 39.4889 23.9086 2.7859 43.2526 0.6316 8.5084 1.2479 9.9614 56.4891 1.8969 7.2325 37.9450 42.5162 57.3064 5.4003 0.1586 20.3028 1.8758 36.8233 51.1157 61.7429 31.2412 78.0892 92.2260 37.9901 123.5865 34.9835 3.0187 27.8431 4.7099 3.9403 8.7312 13.5209 4.6683 8.4340 10.8718 19.3877 2.1137 4.5062 30.2095 10.3681 0.8909 11.1478 27.7319 40.2771 69.9536 2.0772 23.8575 38.5418 308.9753 19.7192 12.8187 18.8662 1.2377 13.5058 15.9509 6.2160 11.3014 8.8582 0.3259 8.7165 24.7851 28.5490 61.6283
temp: 298.150 k
press: 1.00000 atm
elementType: 16 8 8 8 7 7 6 6 6 6 6 6 6 6 6 6 6 6 6 1 1 1 1 1 1 1 1 1 1 1 1 1 1
symmnumber: 1
zpe: 665590.1 jmol-1
zpe.correction: 0.253510 hartree
zpe.thermalcorrener: 0.270947 hartree
zpe.thermalcorrenthalpy: 0.271891 hartree
zpe.thermalcorrgfe: 0.205623 hartree
zpe.sumelectzpe: -1235.633042 hartree
zpe.sumelectthermal: -1235.615605 hartree
zpe.sumelectthermalent: -1235.614661 hartree
zpe.sumelectthermalfe: -1235.680929 hartree
dipole: -0.8090 -1.7370 0.8988
dipole: 2.1165
quadrupole: -130.8223 -108.1926 -114.7964
quadrupole: -4.5617 0.0693 -6.6489
quadrupole: -12.8852 9.7445 3.1407 -4.5617 0.0693 -6.6489
hfenergy: -1235.886552 hartree
pointgroup: C01 [X(C13H14N2O3S1)]
dipole: 0.2961848 0.7700013 0.1128234 debye
polarizability: 240.5377399|9.6083211|187.1897083|5.114752|-13.3596043|113.9757059 unknown
InChI: InChI=1S/C13H14N2O3S/c16-8-1-2-10-9(4-8)7(5-14-10)3-12-15-11(6-19-12)13(17)18/h1-2,4-5,11-12,14-17H,3,6H2
charge 0 multiplicity 1
33 atoms
S  1.89218 1.301925 -1.968001
O  3.861184 0.092849 1.635442
O  5.447523 -1.357265 0.76261
O  -4.084842 -2.932095 0.412386
N  2.507685 -1.103356 -0.848474
N  -2.29682 2.34728 0.032844
C  1.320807 -0.257618 -0.935758
C  0.737591 0.176387 0.433145
C  3.788909 -0.346908 -0.768633
C  3.533898 1.174521 -1.04231
C  -0.62264 0.81233 0.31245
C  -1.895701 0.111689 0.277252
C  -2.929091 1.097499 0.102052
C  -0.913456 2.169964 0.157241
C  4.468113 -0.602366 0.582194
C  -2.256695 -1.259899 0.386044
C  -4.295686 0.748114 0.031599
C  -3.621695 -1.599243 0.314116
C  -4.635325 -0.612438 0.137458
H  0.541812 -0.757857 -1.536406
H  1.456258 0.839424 0.943883
H  0.671956 -0.742545 1.049003
H  4.48751 -0.754984 -1.520406
H  2.542567 -1.807832 -1.592371
H  3.464172 1.741162 -0.102156
H  4.320923 1.604438 -1.680199
H  -0.228587 3.013849 0.109359
H  -2.76736 3.240323 -0.091289
H  -1.49006 -2.033028 0.529374
H  -5.07841 1.502985 -0.101034
H  -5.676674 -0.943436 0.089664
H  4.297774 -0.164034 2.492239
H  -3.325923 -3.552536 0.543578
