program: Gaussian 09
title: 000195328
version: EM64L-G09RevD.01
frameworkgroup: C1[X(C17H12O6)]
method: RPBEPBE
basis: SDD
operation: Freq
keyword: #pfreq=noraman
keyword: PBEPBE/SDD
title: #p freq=noraman PBEPBE/SDD
converged: YES YES NO NO
title: Mulliken charges:
elementType: O O O O O O C C C C C C C C C C C C C C C C C H H H H H H H H H H H H
charge: -0.420909 -0.483003 -0.489585 -0.428583 -0.440727 -0.257902 0.202725 0.282985 0.480508 0.363848 -0.539207 -0.624480 0.272167 -0.515998 -0.585605 0.137807 0.153191 -0.540863 -0.413901 0.170567 -0.327174 0.133465 0.079641 0.295449 0.281381 0.295051 0.242498 0.258952 0.251628 0.252738 0.389483 0.380496 0.374879 0.384913 0.383567
chargesum: 0.00000
title: Mulliken charges with hydrogens summed into heavy atoms:
elementType: O O O O O O C C C C C C C C C C C C C C C C C
charge: -0.031427 -0.102507 -0.114706 -0.043671 -0.057160 -0.257902 0.202725 0.282985 0.480508 0.363848 -0.243757 -0.343099 0.272167 -0.220947 -0.343108 0.137807 0.153191 -0.281912 -0.162273 0.170567 -0.074436 0.133465 0.079641
polarizability: 3.00777182e+02 7.45590367e-01 2.92040933e+02 -8.31513155e+00 -1.23738814e+01 1.07939927e+02
1716.lowfreq: -3.8370 -0.0009 -0.0008 -0.0006 3.9404 6.0695 39.0943 45.8607 50.0771
frequency: 39.0845 45.8603 50.0759 62.4122 71.2080 122.9949 128.1260 157.5053 183.2969 232.6356 236.9388 244.7993 270.7347 280.8817 282.4494 293.6614 298.3328 308.6690 315.5450 352.5879 391.5620 421.7393 427.4870 445.4035 459.4986 492.3200 494.0630 504.6418 527.8650 533.0506 555.1786 577.4563 589.7180 606.7670 614.9112 632.7840 645.3846 684.1818 696.6997 719.5348 735.7636 748.7961 757.1673 781.4106 798.6233 822.3401 838.7437 840.6305 852.1059 904.0674 921.0780 927.8087 942.1626 945.1793 969.8832 1046.1773 1067.0344 1077.2216 1113.7865 1133.0345 1136.2035 1166.0547 1175.2411 1191.6580 1210.4399 1223.5622 1251.1721 1260.7254 1275.5694 1293.3245 1324.8005 1350.3455 1352.0975 1388.5317 1405.7680 1411.5829 1438.1215 1446.1704 1495.2081 1518.2469 1526.5770 1594.7200 1603.9461 1612.9965 1622.4176 1632.8316 1648.0800 3123.5582 3123.5904 3143.7396 3146.2704 3173.2934 3174.8409 3180.1946 3516.3321 3524.3388 3531.1525 3621.4149 3621.6197
redmass: 5.1750 8.0479 7.5022 7.4631 8.3539 7.6394 6.9702 6.2497 6.1434 5.7848 6.5143 5.8740 1.2102 5.2999 5.1381 4.6177 5.8116 3.5882 1.3007 6.5809 7.6774 4.3320 4.0291 3.2444 5.0322 2.3518 1.5898 1.1353 5.0563 2.4090 5.6916 5.0282 6.3683 4.7876 1.5728 4.6910 4.9480 5.8862 4.7358 3.8607 4.9728 6.4815 5.6378 2.8173 7.4525 1.4255 1.7650 2.8867 1.5730 1.4608 4.7429 1.4751 1.3840 1.6210 4.3669 2.8555 2.4474 2.4752 1.8701 1.2949 1.5520 1.4629 1.3150 1.4403 1.5776 2.6452 1.8303 2.0521 2.0054 1.7928 1.9357 5.6011 2.1659 2.8335 5.8237 4.3849 5.1468 6.4839 4.2548 3.8088 4.2568 7.6340 6.1486 6.5258 7.1988 8.0852 7.6334 1.0919 1.0918 1.0921 1.0890 1.0923 1.0955 1.0914 1.0648 1.0648 1.0641 1.0666 1.0666
irintensity: 0.8029 0.1502 0.0465 2.3088 1.6264 1.7206 1.6251 0.3432 0.6831 3.2991 4.3085 1.0229 151.2536 8.3248 11.2516 3.3982 3.5728 13.5521 152.0285 7.5098 5.0707 10.6906 13.7193 2.0743 11.0935 141.6924 33.2898 153.5161 1.3363 17.6607 17.1514 13.8330 14.8730 32.6379 102.7217 29.4596 11.8022 13.3635 3.7727 0.4378 36.4488 27.1218 17.6151 3.8949 3.4253 23.4067 27.1820 23.5875 44.7775 3.8864 20.6240 5.9282 1.7927 41.8931 80.8204 194.6836 118.6952 326.8740 137.1939 38.0120 105.1367 17.5759 149.2535 332.4043 14.4157 104.5272 156.1963 25.8322 163.4482 68.1418 23.1460 44.7936 70.6277 14.9863 14.6756 0.0437 51.9743 7.0659 179.0753 226.7537 73.4503 25.4233 22.8006 61.5417 22.1698 314.0012 39.2853 13.8673 5.6061 0.6288 6.2317 1.8710 6.1314 3.3357 157.9344 109.9624 50.4475 46.8539 82.9514
temp: 298.150 k
press: 1.00000 atm
elementType: 8 8 8 8 8 8 6 6 6 6 6 6 6 6 6 6 6 6 6 6 6 6 6 1 1 1 1 1 1 1 1 1 1 1 1
symmnumber: 1
zpe: 661880.6 jmol-1
zpe.correction: 0.252097 hartree
zpe.thermalcorrener: 0.271871 hartree
zpe.thermalcorrenthalpy: 0.272815 hartree
zpe.thermalcorrgfe: 0.203981 hartree
zpe.sumelectzpe: -1104.770288 hartree
zpe.sumelectthermal: -1104.750514 hartree
zpe.sumelectthermalent: -1104.749569 hartree
zpe.sumelectthermalfe: -1104.818404 hartree
dipole: -2.3501 -3.2997 1.8514
dipole: 4.4541
quadrupole: -128.7657 -119.2655 -129.8173
quadrupole: 14.0688 7.6912 -7.7728
quadrupole: -2.8162 6.6840 -3.8678 14.0688 7.6912 -7.7728
hfenergy: -1105.0223846 hartree
pointgroup: C01 [X(C17H12O6)]
dipole: -0.9866453 -1.1196483 0.9185524 debye
polarizability: 300.8093263|-1.1519038|283.6268711|-9.0610024|-40.1458997|116.3218443 unknown
InChI: InChI=1S/C17H12O6/c18-13-2-1-8(5-14(13)19)11-4-10(17(22)23)3-9-6-15(20)16(21)7-12(9)11/h1-7,18-22H
charge 0 multiplicity 1
35 atoms
O  -0.976375 -4.246291 0.268209
O  -3.589426 -3.759137 0.550895
O  4.391485 -1.183371 1.704963
O  5.759775 -0.043252 -0.321085
O  -1.370093 4.49128 -0.5742
O  -3.58813 3.874935 -0.276605
C  -0.881118 -0.521942 0.008167
C  0.052022 0.575619 -0.173857
C  -2.302785 -0.22652 0.11195
C  1.531618 0.369829 -0.223097
C  -0.446628 1.880322 -0.300893
C  -2.758899 1.116959 -0.003999
C  -1.846858 2.159151 -0.2244
C  -0.464991 -1.892489 0.051138
C  -3.238777 -1.299922 0.304432
C  -1.391546 -2.915984 0.230861
C  -2.790402 -2.610769 0.370951
C  2.211362 -0.363044 0.791593
C  2.303314 0.962458 -1.258124
C  3.608363 -0.491826 0.750329
C  3.708302 0.827308 -1.29825
C  4.370565 0.09797 -0.293838
C  -2.379477 3.53785 -0.350741
H  0.245427 2.716909 -0.427359
H  -3.826669 1.351732 0.069817
H  0.584442 -2.161228 -0.086563
H  -4.306952 -1.063298 0.387801
H  1.644613 -0.794459 1.625951
H  1.793999 1.518782 -2.051752
H  4.300935 1.2745 -2.101325
H  -1.77216 -4.830478 0.386191
H  -4.549419 -3.542578 0.623485
H  3.837871 -1.598624 2.40835
H  6.041771 -0.583874 0.463623
H  -1.794664 5.387679 -0.647718
