program: Gaussian 09
title: 000195349
version: EM64L-G09RevD.01
frameworkgroup: C1[X(C20H34O4)]
method: RPBEPBE
basis: SDD
operation: Freq
keyword: #pfreq=noraman
keyword: PBEPBE/SDD
title: #p freq=noraman PBEPBE/SDD
converged: YES YES NO NO
title: Mulliken charges:
elementType: O O O O C C C C C C C C C C C C C C C C C C C C H H H H H H H H H H H H H H H H H H H H H H H H H H H H H H H H H H
charge: -0.425080 -0.301541 -0.325635 -0.437501 -0.384459 -0.390974 -0.386111 -0.364735 -0.381105 -0.396546 -0.373649 -0.644148 -0.352767 0.473827 -0.356946 0.235311 -0.105763 -0.081418 0.097530 -0.696402 -0.005519 -0.868667 -0.519139 -0.518279 0.194686 0.193100 0.195856 0.198503 0.193638 0.194526 0.199810 0.188206 0.192386 0.191497 0.221341 0.215964 0.189445 0.190095 0.251341 0.201350 0.187890 0.187255 0.195002 0.194749 0.209703 0.209515 0.215247 0.228564 0.223167 0.287851 0.361216 0.376058 0.264787 0.215971 0.224450 0.274533 0.225796 0.216218
chargesum: 0.00000
title: Mulliken charges with hydrogens summed into heavy atoms:
elementType: O O O O C C C C C C C C C C C C C C C C C C C C
charge: -0.063865 -0.301541 -0.325635 -0.061443 0.003327 0.003385 0.002053 0.023281 0.002778 0.040760 0.005891 -0.191457 0.022378 0.473827 0.032805 0.235311 -0.105763 -0.081418 0.097530 -0.061938 -0.005519 -0.129086 0.186069 0.198267
polarizability: 3.16155770e+02 6.47702325e+00 2.32807130e+02 -2.33907841e+01 1.93491345e+00 1.73698327e+02
1716.lowfreq: -4.7882 -0.0017 -0.0007 0.0008 3.8538 8.5376 12.0364 18.0868 27.7564
frequency: 11.2366 18.0397 27.7506 33.1411 42.6041 60.3105 69.7352 74.2008 82.2460 95.0356 99.9214 104.2356 109.6953 120.9271 131.3353 135.9430 138.9575 143.5952 153.6281 159.2917 168.7371 176.6245 181.8834 217.7377 228.7606 249.4868 267.5612 274.1733 299.2050 306.4592 316.1875 324.0782 347.6133 351.9683 366.6499 399.1441 406.2874 417.2122 453.5946 474.5721 484.4450 500.1813 549.3917 573.9908 603.8255 643.1829 662.5614 677.5637 720.0652 722.6793 728.1449 740.8775 767.1854 792.8594 804.6268 826.4339 860.1898 874.3716 887.5300 916.7923 925.3077 962.7086 975.5093 982.5679 994.0324 1010.4047 1021.1201 1031.2751 1037.4988 1039.9484 1060.7811 1067.7189 1077.5213 1078.4036 1080.4516 1082.8311 1088.9987 1112.8954 1114.4663 1116.2106 1122.2859 1155.1324 1158.1545 1181.5671 1198.0415 1201.1892 1203.7852 1227.6641 1231.7404 1235.7990 1251.6724 1255.8074 1262.3624 1275.3694 1276.4071 1283.6227 1286.5308 1289.8221 1292.1604 1293.9537 1313.4205 1332.6623 1346.7840 1351.8340 1354.8086 1355.2977 1359.7903 1388.1015 1390.3256 1398.6495 1406.9860 1431.0269 1441.1394 1454.5098 1456.6824 1459.7713 1459.8345 1463.5068 1463.7224 1467.3543 1468.9962 1472.9432 1476.3337 1477.7644 1481.5975 1482.5888 1485.2943 1486.6281 1487.7504 1488.4853 1489.7335 1509.1308 1594.1907 1627.0437 2917.1364 2947.0392 2948.2395 2948.8750 2950.3422 2952.6625 2957.5182 2962.7576 2967.4438 2970.8674 2972.9168 2973.4155 2977.0803 2978.0677 2981.0746 2983.9751 2988.4472 2995.5067 3006.3465 3017.2821 3026.3337 3033.8920 3041.1280 3044.2898 3051.3774 3067.3719 3069.8808 3084.5306 3089.0961 3108.6213 3124.1619 3130.5781 3455.1336 3578.5029
redmass: 4.4287 4.3759 4.1731 1.5425 4.1797 3.3354 1.5603 3.0979 3.1937 2.8225 3.3250 2.6158 1.7759 3.8041 1.0713 2.1035 2.5262 1.9453 1.8410 1.4598 3.3409 1.3780 2.8652 3.9397 1.1177 4.4270 4.4296 3.9097 1.7282 1.7916 4.0712 3.8852 4.3472 3.2930 3.1274 3.6944 5.8295 4.9579 6.6318 3.1089 3.6271 4.8047 5.3986 1.1752 4.5550 4.8987 4.3822 4.4271 1.0596 1.0682 1.0877 1.1355 1.2057 5.9607 1.4756 2.6535 1.5811 3.3963 1.9086 1.4222 3.5556 2.0007 4.8214 1.7385 4.1551 3.5259 1.1873 3.1810 1.7595 1.7255 3.0358 2.8868 4.4032 2.3991 2.1122 2.3323 3.5591 1.6022 1.2451 1.2842 2.7831 1.3592 1.4166 1.8847 1.6007 1.2991 1.5590 1.6601 1.5208 1.7719 1.6936 1.3257 1.3829 1.1571 1.0618 1.0596 1.1832 1.2727 1.1053 1.1168 1.3761 1.4175 1.4941 1.7110 1.6155 1.6742 4.8646 1.2171 3.9614 1.3201 2.0357 1.2233 1.5685 1.1070 1.0640 1.0746 1.0741 1.0691 1.0723 1.0914 1.1576 1.0929 1.0427 1.1013 1.2097 1.0641 1.3655 1.2151 1.0555 1.1367 1.2566 1.2208 9.1677 6.7536 1.0717 1.0588 1.0585 1.0588 1.0590 1.0594 1.0594 1.0588 1.0587 1.0364 1.0598 1.0416 1.0327 1.0334 1.0958 1.0964 1.0982 1.1007 1.1027 1.1029 1.1010 1.1014 1.1029 1.0972 1.0958 1.1006 1.0993 1.1002 1.0988 1.0960 1.1045 1.1056 1.0636 1.0651
irintensity: 0.0334 0.0084 0.0173 0.0076 0.0706 0.0082 0.0599 2.9246 5.6970 2.1712 1.5263 0.3944 0.0198 1.6719 0.0957 0.1828 1.7742 0.0265 0.5030 0.5687 0.6160 2.6208 0.6007 1.4575 0.0005 6.5655 3.3105 4.3872 48.5082 61.0763 19.3917 7.0485 7.8854 3.0958 1.8003 1.1075 0.7941 1.7587 1.7776 0.3441 2.3622 2.7900 10.5193 117.5464 13.2883 2.8665 2.7493 5.1828 15.9909 0.3225 6.2170 0.1772 1.4882 2.3851 1.2313 25.4043 22.3806 49.4245 4.4928 5.5263 37.4252 12.6140 1.5962 19.1392 1.9165 0.8235 10.7426 0.3619 80.6070 40.8557 4.0121 2.0478 111.2930 1.2021 1.2868 2.1794 20.9144 25.2216 12.4853 3.5017 17.2623 6.4105 8.1762 0.1916 292.9933 28.5548 11.9040 2.6474 8.6955 8.1735 30.8233 3.8384 1.8069 3.0156 1.4865 0.0900 0.9415 1.0055 0.6054 0.5332 0.3744 0.6683 0.2568 0.0854 0.2438 2.1914 61.7363 11.3723 51.0975 39.4840 80.7801 4.7446 36.8256 11.1477 6.1470 0.0296 0.3399 0.4699 0.4787 8.3172 42.7094 3.7674 12.3993 6.7328 11.7101 18.9070 6.9791 10.0929 19.0956 19.3294 29.2444 22.9269 10.1902 1.4213 37.2620 6.0989 0.9473 1.0991 2.4600 2.7069 0.1686 76.0566 168.3984 39.0610 40.6076 61.0463 106.2675 54.3894 1.0060 2.2632 1.9098 0.8998 0.5795 2.2545 5.5979 2.5836 199.5534 28.3768 89.3712 97.9219 55.3279 31.0185 31.3150 5.0413 19.6720 13.9984 75.8824 26.8063
temp: 298.150 k
press: 1.00000 atm
elementType: 8 8 8 8 6 6 6 6 6 6 6 6 6 6 6 6 6 6 6 6 6 6 6 6 1 1 1 1 1 1 1 1 1 1 1 1 1 1 1 1 1 1 1 1 1 1 1 1 1 1 1 1 1 1 1 1 1 1
symmnumber: 1
zpe: 1317967.5 jmol-1
zpe.correction: 0.501987 hartree
zpe.thermalcorrener: 0.531784 hartree
zpe.thermalcorrenthalpy: 0.532728 hartree
zpe.thermalcorrgfe: 0.437835 hartree
zpe.sumelectzpe: -1081.468246 hartree
zpe.sumelectthermal: -1081.438449 hartree
zpe.sumelectthermalent: -1081.437505 hartree
zpe.sumelectthermalfe: -1081.532399 hartree
dipole: -1.6403 0.9761 0.6623
dipole: 2.0203
quadrupole: -145.0819 -148.0015 -149.9552
quadrupole: 5.3230 -0.8019 -3.5615
quadrupole: 2.5976 -0.3219 -2.2756 5.3230 -0.8019 -3.5615
hfenergy: -1081.9702334 hartree
pointgroup: C01 [X(C20H34O4)]
dipole: 0.6382494 0.4080146 -0.2407788 debye
polarizability: 316.1182443|-3.8557367|232.6980396|-24.2612334|1.061572|173.8449427 unknown
InChI: InChI=1S/C20H34O4/c1-5-6-7-8-9-10-11-12-13-14-16-15(2)17(21)19(23-3)20(24-4)18(16)22/h21-22H,5-14H2,1-4H3
charge 0 multiplicity 1
58 atoms
O  -2.552101 1.878773 -1.030279
O  -5.112281 2.125814 0.143574
O  -6.399768 -0.255888 1.163109
O  -5.256072 -2.663158 0.895042
C  3.902041 -0.257838 -0.618896
C  2.505408 -0.131952 0.030423
C  5.061561 0.076619 0.346256
C  1.351324 -0.4612 -0.942921
C  6.455536 -0.057379 -0.307168
C  -0.045812 -0.350129 -0.294675
C  7.619368 0.28485 0.650244
C  -1.196295 -0.696332 -1.283748
C  9.011379 0.149457 -0.007247
C  -2.583139 -0.578613 -0.664972
C  10.177165 0.498253 0.946121
C  -3.26916 -1.729357 -0.176494
C  -3.187751 0.703487 -0.556431
C  -4.547024 -1.553978 0.400037
C  -4.463014 0.878618 0.045561
C  11.562913 0.362412 0.27866
C  -5.145641 -0.270871 0.50288
C  -2.679257 -3.125932 -0.261381
C  -4.389098 3.175126 0.89703
C  -7.520578 0.377359 0.426353
H  4.033848 -1.290404 -1.005092
H  3.957223 0.412722 -1.502313
H  2.374039 0.898485 0.422063
H  2.447564 -0.807395 0.90935
H  4.933901 1.11107 0.728745
H  5.006188 -0.590548 1.231971
H  1.489161 -1.489314 -1.338801
H  1.409346 0.217816 -1.820591
H  6.584634 -1.093578 -0.684562
H  6.507515 0.604857 -1.196991
H  -0.107611 -1.036277 0.573155
H  -0.190594 0.670675 0.113928
H  7.491536 1.321574 1.026719
H  7.568882 -0.376625 1.540654
H  -1.039381 -1.724196 -1.655529
H  -1.099548 -0.052893 -2.188406
H  9.142447 -0.888273 -0.379851
H  9.061016 0.807611 -0.900265
H  10.127994 -0.160271 1.837528
H  10.044652 1.534679 1.318775
H  11.73195 -0.671924 -0.076336
H  11.64794 1.034217 -0.596528
H  12.378822 0.616377 0.980302
H  -2.569607 -3.460701 -1.311123
H  -1.678799 -3.178361 0.20727
H  -3.336466 -3.843895 0.252041
H  -1.729527 1.636574 -1.523234
H  -6.095166 -2.303906 1.297659
H  -3.436372 3.419657 0.399595
H  -4.206894 2.843014 1.936946
H  -5.06266 4.045905 0.892598
H  -7.287114 1.435222 0.228549
H  -8.39329 0.283365 1.090701
H  -7.703735 -0.157699 -0.525205
