program: Gaussian 09
title: 000195312
version: EM64L-G09RevD.01
frameworkgroup: C1[X(C14H26O6)]
method: RPBEPBE
basis: SDD
operation: Freq
keyword: #pfreq=noraman
keyword: PBEPBE/SDD
title: #p freq=noraman PBEPBE/SDD
converged: YES YES NO NO
title: Mulliken charges:
elementType: O O O O O O C C C C C C C C C C C C C C H H H H H H H H H H H H H H H H H H H H H H H H H H
charge: -0.259776 -0.292214 -0.289476 -0.284648 -0.284335 -0.257408 -0.028143 -0.053581 -0.093643 -0.079713 -0.361985 -0.347731 -0.216482 -0.233240 0.324690 -0.692002 -0.187076 -0.682625 -0.770608 -0.684804 0.227950 0.291654 0.213381 0.217460 0.206194 0.244083 0.214240 0.216127 0.184391 0.243284 0.236240 0.180761 0.229342 0.217853 0.208004 0.192319 0.178986 0.203211 0.227017 0.223931 0.255073 0.246348 0.244254 0.226740 0.246435 0.199525
chargesum: 0.00000
title: Mulliken charges with hydrogens summed into heavy atoms:
elementType: O O O O O O C C C C C C C C C C C C C C
charge: -0.259776 -0.292214 -0.289476 -0.284648 -0.284335 -0.257408 0.199807 0.238073 0.119738 0.137747 0.088292 0.082635 0.211193 0.183761 0.324690 -0.036804 0.184230 -0.028466 -0.024934 -0.012104
polarizability: 2.08882947e+02 7.92193587e+00 1.71638992e+02 3.94939197e+00 -3.39204269e+00 1.42781288e+02
1716.lowfreq: -44.1204 -6.6464 -0.0006 -0.0004 0.0006 5.2502 6.4117 14.3301 25.5768
frequency: -44.0745 14.2231 25.5533 35.7184 46.1092 50.6479 68.7090 70.1186 78.2900 84.1109 92.2622 105.7891 120.2660 128.8165 162.3460 180.7735 187.7906 208.1668 229.1845 234.7208 238.9332 245.1427 249.2894 265.5445 293.1189 306.6339 358.1224 385.4851 417.5996 462.2159 470.3890 488.6080 505.7910 537.9335 572.4235 609.7680 633.6944 657.3348 811.0638 812.5148 816.1084 819.6635 825.0594 840.0317 845.7432 861.0912 894.8093 922.8787 959.6448 996.2967 999.3811 1003.6502 1008.1139 1034.0136 1043.7808 1049.2321 1054.8290 1058.2510 1066.0836 1080.1498 1085.8999 1104.9984 1110.2232 1124.9364 1130.6784 1136.5492 1136.9806 1142.5819 1160.0998 1189.8607 1193.5144 1207.9634 1243.6527 1249.3033 1249.8595 1256.2070 1264.1006 1290.7291 1298.1840 1307.1106 1321.3731 1330.6256 1336.9161 1351.3341 1354.0532 1380.5926 1382.0734 1385.6333 1389.5438 1396.5149 1398.4172 1403.2077 1454.8440 1457.9400 1458.1073 1458.5272 1460.8203 1469.2264 1474.5360 1480.5572 1482.5959 1483.8969 1495.3761 1498.4071 1498.6138 1640.1663 2916.0004 2938.9083 2939.5789 2940.8695 2956.3157 2958.6871 2963.8809 2973.1352 2982.4923 2990.9269 2991.8561 2993.4543 3005.8806 3014.2515 3018.2022 3039.2283 3053.6856 3082.3196 3089.2409 3089.5187 3091.6907 3093.2590 3096.9617 3098.9051 3101.2653 3137.5293
redmass: 1.0661 4.2158 3.5591 3.7349 2.5482 2.6152 2.1124 2.3542 2.9262 2.6158 3.3433 2.7274 4.3858 3.4465 3.9319 3.6152 3.6118 4.8037 1.6229 1.1711 2.9823 1.4327 2.2546 3.4198 4.2603 4.1661 3.6607 4.0522 3.4750 3.9010 3.9394 3.9180 3.8125 3.7095 3.5877 3.9340 3.9238 4.0462 2.3037 1.6133 1.1595 1.7124 1.1707 3.0935 3.2173 3.1548 2.0211 5.3708 3.6548 2.1818 2.3586 3.2415 3.2429 2.9438 1.8265 3.3117 4.3265 2.8887 4.4271 5.2483 2.8813 2.4159 2.1362 2.5274 2.0306 1.4328 1.4450 1.4897 1.8290 1.7483 2.1344 1.3662 1.1661 1.2777 1.1529 1.2004 1.1374 1.2443 1.1964 1.2143 1.3284 1.2598 1.2786 1.4196 1.3286 1.2655 1.2281 1.2515 1.2831 1.3202 1.3505 1.4642 1.0654 1.0411 1.0466 1.0404 1.0413 1.0828 1.0769 1.0456 1.0450 1.0529 1.0777 1.0829 1.0834 10.4404 1.0554 1.0796 1.0624 1.0673 1.0814 1.0564 1.1050 1.0817 1.0698 1.0357 1.0359 1.0358 1.0366 1.1012 1.1066 1.0969 1.0846 1.0987 1.0989 1.0988 1.0991 1.0971 1.1011 1.1011 1.1012 1.1012
irintensity: 1.4625 0.1715 1.0148 0.4923 0.0153 2.8560 1.8815 0.8281 0.6447 4.3445 6.2083 4.9768 3.0894 1.6787 16.6644 0.1937 1.4666 1.6055 1.1263 1.1501 1.7608 0.4220 0.9089 5.9561 3.5679 4.9051 8.6966 1.3265 10.0192 7.3157 1.8500 1.2699 11.4646 8.5995 8.1159 2.0179 10.1543 13.6387 8.0752 8.2055 3.4478 3.7273 3.8327 4.0478 15.8307 9.8471 6.0960 63.9246 33.4825 59.1147 16.4835 29.7240 6.1751 37.5874 7.2050 26.7363 94.2796 63.0078 165.3084 99.2847 49.1711 38.8711 6.3966 6.4098 3.1044 2.5041 11.0800 3.8913 3.5061 106.3060 224.0015 28.1230 2.5053 4.8542 0.4409 4.1142 3.7117 14.5015 19.1973 1.6999 4.2376 2.2237 20.3394 11.4697 7.7371 2.5719 56.5298 19.7171 12.4013 19.1500 14.9787 17.3748 12.0157 11.0855 13.9275 12.0889 11.6553 5.1028 11.0294 7.4870 6.4754 0.5467 8.2894 3.4286 3.6843 170.2375 67.9582 15.9712 64.3996 34.0036 19.0090 51.7567 78.0056 44.4437 80.3556 23.1927 33.5050 21.2851 4.2171 12.6731 49.9094 14.7349 8.1818 17.1802 27.9914 43.2112 34.6590 7.9399 34.5329 42.0681 31.9459 7.7923
temp: 298.150 k
press: 1.00000 atm
elementType: 8 8 8 8 8 8 6 6 6 6 6 6 6 6 6 6 6 6 6 6 1 1 1 1 1 1 1 1 1 1 1 1 1 1 1 1 1 1 1 1 1 1 1 1 1 1
symmnumber: 1
zpe: 1018676.4 jmol-1
zpe.correction: 0.387993 hartree
zpe.thermalcorrener: 0.411627 hartree
zpe.thermalcorrenthalpy: 0.412571 hartree
zpe.thermalcorrgfe: 0.331862 hartree
zpe.sumelectzpe: -998.743373 hartree
zpe.sumelectthermal: -998.719739 hartree
zpe.sumelectthermalent: -998.718795 hartree
zpe.sumelectthermalfe: -998.799504 hartree
dipole: 0.8679 0.1237 0.4692
dipole: 0.9943
quadrupole: -108.2505 -120.1069 -121.1850
quadrupole: -4.8008 8.7932 9.7394
quadrupole: 8.2636 -3.5927 -4.6709 -4.8008 8.7932 9.7394
hfenergy: -999.1313661 hartree
pointgroup: C01 [X(C14H26O6)]
dipole: -0.2875507 0.2309708 0.1303524 debye
polarizability: 203.113127|-15.0003486|151.0974313|-14.3036697|-7.7887472|169.0926689 unknown
InChI: InChI=1S/C14H26O6/c1-5-16-8-11-14(20-10(4)15)13(18-7-3)12(9-19-11)17-6-2/h11-14H,5-9H2,1-4H3
charge 0 multiplicity 1
46 atoms
O  0.055601 1.615418 -1.966867
O  1.45095 -1.233337 0.820569
O  -0.866916 1.260924 0.929281
O  3.240273 -0.033446 -1.173537
O  -3.183607 0.230218 -0.960855
O  -2.067899 -0.231764 2.278875
C  1.092386 -0.007236 0.102001
C  -0.453871 0.176651 -0.015293
C  1.780224 -0.117271 -1.278784
C  -0.868951 0.602677 -1.440961
C  1.400317 1.059058 -2.213112
C  -2.264938 1.223194 -1.519934
C  1.232349 -1.174908 2.281988
C  3.936822 -1.334303 -1.047327
C  -1.711161 0.934927 1.997374
C  1.851114 -2.43622 2.883102
C  -4.556754 0.732389 -0.811146
C  5.43413 -1.031082 -1.018122
C  -2.102211 2.182103 2.763077
C  -5.369068 -0.365766 -0.125719
H  1.503185 0.883989 0.624594
H  -0.980223 -0.752685 0.268534
H  1.493133 -1.094275 -1.724146
H  -0.849113 -0.31114 -2.076919
H  1.48034 0.738561 -3.271253
H  2.106147 1.887204 -2.035168
H  -2.512523 1.447344 -2.578322
H  -2.286733 2.165986 -0.935744
H  1.715924 -0.25772 2.684701
H  0.146561 -1.127399 2.497549
H  3.598763 -1.844489 -0.127154
H  3.676155 -1.971877 -1.920975
H  1.380572 -3.337625 2.453537
H  2.935534 -2.478146 2.679488
H  1.697786 -2.452768 3.97765
H  -4.976274 0.984083 -1.81074
H  -4.546913 1.664211 -0.200994
H  6.013394 -1.96929 -0.937501
H  5.681573 -0.391844 -0.15289
H  5.744864 -0.504127 -1.937085
H  -1.640212 3.080736 2.329999
H  -1.797814 2.076332 3.818824
H  -3.201566 2.28576 2.751196
H  -5.382248 -1.279459 -0.744594
H  -4.91979 -0.617307 0.850474
H  -6.411607 -0.034882 0.034028
