program: Gaussian 09
title: 000195296
version: EM64L-G09RevD.01
frameworkgroup: C1[X(C17H22N2O)]
method: RPBEPBE
basis: SDD
operation: Freq
keyword: #p
keyword: freq=noraman
keyword: PBEPBE/SDD
title: #p freq=noraman PBEPBE/SDD
converged: NO YES NO NO
title: Mulliken charges:
elementType: O N N C C C C C C C C C C C C C C C C C H H H H H H H H H H H H H H H H H H H H H H
charge: -0.280452 -0.178577 -0.409537 0.270994 -0.302902 -0.163648 -0.622728 0.180863 -0.584693 0.217260 -0.434654 0.462981 0.003107 -0.267007 -0.673405 -0.648796 -0.835245 -0.320423 0.040961 -0.677286 0.233845 0.234396 0.239376 0.219438 0.234174 0.266798 0.228686 0.243982 0.282281 0.323722 0.253009 0.221171 0.221710 0.221188 0.212640 0.220717 0.229060 0.230891 0.220148 0.243233 0.221061 0.221661
chargesum: 0.00000
title: Mulliken charges with hydrogens summed into heavy atoms:
elementType: O N N C C C C C C C C C C C C C C C C C
charge: -0.280452 -0.178577 -0.085815 0.270994 -0.069057 0.070748 -0.163913 0.180863 -0.083721 0.217260 -0.205968 0.462981 0.247090 0.015274 0.022485 0.005749 -0.155146 -0.077190 0.040961 -0.234564
polarizability: 2.28163155e+02 -2.65553233e+00 1.69622216e+02 5.51893102e+00 2.66477355e+00 1.88662032e+02
1716.lowfreq: -0.0006 0.0003 0.0005 0.9942 9.8576 16.9661 52.1467 77.7053 86.6616
frequency: 51.9602 77.6726 86.6426 88.0398 97.6511 142.3480 166.5491 173.9569 188.0071 201.6329 212.8678 220.0511 238.2041 270.9640 291.8563 308.7592 316.3279 339.8412 357.7416 366.2699 378.6804 395.3776 403.6494 447.8204 458.5175 475.2195 505.8828 515.1278 535.0199 551.3913 606.2282 646.2316 659.1804 678.9684 713.0055 723.8573 761.8410 771.1923 804.7922 818.0925 838.8958 860.9507 890.1780 903.2855 923.8914 943.4473 948.1056 964.7804 978.1954 1006.7689 1014.2728 1019.6017 1029.8289 1039.9880 1042.1123 1069.1888 1070.2897 1090.9086 1097.9738 1100.9314 1141.0028 1153.7412 1162.3065 1167.0395 1180.8592 1189.2967 1200.7413 1210.0237 1235.3408 1247.8238 1261.8044 1276.3205 1292.3936 1297.6482 1302.5979 1317.6689 1333.2045 1347.2146 1355.9708 1394.9963 1396.0634 1423.6364 1424.0785 1429.6927 1443.6527 1447.8780 1457.1483 1461.3016 1465.7197 1470.9526 1477.7268 1485.1274 1500.4994 1549.0414 1603.3887 1649.6680 1660.8868 1694.5376 2892.2040 2918.4636 2960.7718 2965.7655 2974.4834 2989.0220 2999.9055 3005.3458 3016.7845 3020.7806 3021.8886 3033.1785 3077.8142 3080.2605 3086.2217 3089.7618 3097.0876 3098.4284 3130.5423 3179.2936 3188.8415 3498.3465
redmass: 5.2570 3.4499 2.7444 3.7205 2.7032 2.9495 2.2144 1.5750 2.3748 1.9109 1.5977 2.0707 1.5934 2.7464 2.1529 4.1943 3.2007 3.0683 3.3816 3.0226 3.3213 3.2329 2.7668 3.3398 2.6139 4.0210 3.2029 2.9297 4.1820 3.9556 2.8549 3.4679 3.0537 2.6825 5.0694 2.2802 1.8638 3.4455 2.6978 1.8919 1.6229 3.0596 2.0586 2.8021 2.7976 1.4704 1.9633 1.6843 1.8555 2.2111 1.3004 1.3327 1.9716 1.7098 1.5674 2.2885 2.4725 1.2948 2.1125 1.8154 1.4601 2.1584 1.8281 1.6423 2.1585 2.1026 2.1662 1.4090 2.4252 1.8923 2.2351 1.4719 1.5272 1.2770 1.5107 1.5591 1.5154 1.9337 1.6950 2.5097 1.2640 1.3054 2.1909 1.2097 1.0884 1.1522 1.1156 1.0480 1.0551 1.0655 1.0572 1.0514 1.0536 7.4178 4.5493 4.5788 7.0069 6.8919 1.0541 1.0487 1.0380 1.0608 1.0588 1.0830 1.0852 1.0876 1.0995 1.0928 1.0846 1.0966 1.0625 1.0984 1.0958 1.0904 1.0912 1.0943 1.0894 1.0951 1.1137 1.0767
irintensity: 1.7440 0.2009 0.8579 0.3081 0.4444 0.8605 0.7117 0.8590 2.2116 1.6870 0.1376 0.6629 0.7256 1.6415 1.0296 2.4954 5.5640 0.4223 4.4888 0.8544 1.3422 1.8927 2.4132 8.5491 7.0275 1.6579 2.0358 4.4615 8.4870 1.7678 20.5152 2.6581 6.6642 5.6824 2.2252 13.2753 36.9132 2.7431 10.5404 8.2975 44.6363 0.6075 12.4885 3.8869 21.8707 52.8284 16.4813 7.1174 7.0012 5.1291 2.5627 0.9442 62.2416 4.8503 9.6776 4.7087 13.2953 15.2834 13.2693 24.2623 0.9606 5.2648 1.5613 4.7784 3.4954 16.3306 11.7242 1.9894 4.7670 2.3934 4.9474 23.4907 6.6152 2.9232 26.3153 8.2866 5.2426 10.8226 4.0246 17.6808 15.1015 5.8778 10.0765 10.0690 2.3112 8.3387 15.1753 17.8313 10.1484 9.1126 20.4672 4.6539 3.1609 28.4456 216.2178 11.6015 440.0068 3.9646 74.2924 105.3756 33.6422 23.6794 34.2952 35.2315 37.3750 54.5709 18.0143 26.7596 40.0695 27.7022 15.3647 22.5695 30.1089 13.5473 35.2464 23.3402 3.2086 4.8246 21.3130 29.7450
temp: 298.150 k
press: 1.00000 atm
elementType: 8 7 7 6 6 6 6 6 6 6 6 6 6 6 6 6 6 6 6 6 1 1 1 1 1 1 1 1 1 1 1 1 1 1 1 1 1 1 1 1 1 1
symmnumber: 1
zpe: 928991.2 jmol-1
zpe.correction: 0.353834 hartree
zpe.thermalcorrener: 0.372676 hartree
zpe.thermalcorrenthalpy: 0.373620 hartree
zpe.thermalcorrgfe: 0.308850 hartree
zpe.sumelectzpe: -844.206379 hartree
zpe.sumelectthermal: -844.187537 hartree
zpe.sumelectthermalent: -844.186593 hartree
zpe.sumelectthermalfe: -844.251362 hartree
dipole: 5.7388 1.2723 0.9091
dipole: 5.9481
quadrupole: -149.1794 -115.5623 -111.0836
quadrupole: -5.1267 -2.0620 1.4670
quadrupole: -23.9043 9.7128 14.1915 -5.1267 -2.0620 1.4670
hfenergy: -844.5602126 hartree
pointgroup: C01 [X(C17H22N2O1)]
dipole: -2.3024626 0.1241057 -0.399427 debye
polarizability: 225.9038336|11.7145569|171.5650952|5.3922394|-0.229|188.978475 unknown
InChI: InChI=1S/C17H22N2O/c1-5-13-12-8-11(2)10-17(13,19(3)4)14-6-7-16(20)18-15(14)9-12/h5-8,12-13,18H,1,9-10H2,2-4H3
charge 0 multiplicity 1
42 atoms
O  4.731778 0.117641 -0.210006
N  -1.267611 -1.375677 1.499763
N  2.531297 0.262573 -0.995629
C  -0.932963 -0.242476 0.567061
C  -1.702824 -0.264056 -0.811373
C  -1.125018 0.886502 -1.701114
C  -1.306504 1.102266 1.281393
C  0.590086 -0.207973 0.334817
C  0.338482 0.550557 -2.106879
C  1.149763 0.175903 -0.882524
C  -1.180781 2.217999 -0.972139
C  -1.242313 2.328944 0.382608
C  -1.653578 -1.584906 -1.553255
C  1.491584 -0.442833 1.436509
C  -0.691475 -2.711405 1.210212
C  -2.690482 -1.526832 1.871184
C  -1.272779 3.668347 1.090427
C  2.867663 -0.350303 1.30673
C  3.488272 0.006614 0.037218
C  -2.720311 -2.162784 -2.159678
H  -2.764022 -0.018939 -0.606234
H  -1.729276 0.943916 -2.627952
H  -0.631203 1.231194 2.149602
H  -2.329783 1.046423 1.702823
H  0.796962 1.429066 -2.602265
H  0.351143 -0.275791 -2.846471
H  -1.135287 3.125108 -1.591262
H  -0.670122 -2.073696 -1.627124
H  1.044363 -0.715111 2.399962
H  2.944575 0.553321 -1.888533
H  0.351279 -2.624396 0.86815
H  -1.26151 -3.285635 0.445822
H  -0.691135 -3.305396 2.145058
H  -2.760264 -2.272464 2.68485
H  -3.332037 -1.888358 1.032363
H  -3.118267 -0.58712 2.255398
H  -1.302396 4.510193 0.377221
H  -0.380596 3.795457 1.735024
H  -2.156046 3.750167 1.754823
H  3.54388 -0.534482 2.145569
H  -2.628841 -3.100245 -2.719594
H  -3.722302 -1.716113 -2.109455
