program: Gaussian 09
title: 000195251
version: EM64L-G09RevD.01
frameworkgroup: C1[X(C8H6N2O2S)]
method: RPBEPBE
basis: SDD
operation: Freq
keyword: #p
keyword: freq=noraman
keyword: PBEPBE/SDD
title: #p freq=noraman PBEPBE/SDD
converged: NO NO NO NO
title: Mulliken charges:
elementType: S O O N N C C C C C C C C H H H H H H
charge: 0.322684 -0.213857 -0.252971 -0.292402 0.068205 -0.352189 -0.322617 0.179101 0.170755 0.327690 -0.492072 -0.188703 -0.529555 0.269087 0.269100 0.248511 0.248467 0.272892 0.267874
chargesum: 0.00000
title: Mulliken charges with hydrogens summed into heavy atoms:
elementType: S O O N N C C C C C C C C
charge: 0.322684 -0.213857 -0.252971 -0.292402 0.068205 0.185998 0.174361 0.179101 0.170755 0.327690 -0.492072 0.084189 -0.261681
polarizability: 1.83543485e+02 -1.74550230e+00 1.23257065e+02 1.97017810e-03 -3.17548673e-03 5.32107432e+01
1716.lowfreq: -54.0146 -0.0012 -0.0007 0.0019 5.3573 5.5114 9.4932 101.4450 130.2639
frequency: -53.8930 101.4444 130.2629 154.3929 248.9617 249.4033 287.7964 313.5629 366.4199 442.4649 496.9510 551.4757 595.4148 604.4677 660.0895 677.7103 699.1691 703.3539 730.2572 774.1224 797.6542 826.1017 831.1055 908.7225 929.1759 973.1037 999.7635 1053.0036 1092.9319 1102.9348 1179.3722 1202.9225 1212.1515 1221.4860 1250.2897 1283.6047 1338.4002 1368.5452 1409.5232 1463.6418 1488.4225 1499.5952 1513.1191 1558.5907 1639.5566 3032.4596 3051.6609 3088.7311 3123.8708 3189.2084 3238.6380
redmass: 1.8996 4.5625 6.9588 10.7628 5.5897 6.8449 7.7273 7.5814 10.1354 8.8185 4.8657 12.0217 10.3765 5.1571 10.5195 8.7081 9.7268 1.6162 7.3507 3.7407 5.6479 8.3630 1.1446 1.3317 5.7782 4.8217 3.5149 5.3756 1.2654 1.5540 1.1197 1.0942 3.2018 2.2600 2.8177 7.3458 1.4217 2.5024 3.8560 9.7571 1.1019 1.1281 6.0832 9.7448 12.1665 1.0586 1.0589 1.1086 1.1111 1.0923 1.1003
irintensity: 1.7199 12.6703 0.0524 4.2558 0.1747 3.7955 10.8670 0.0192 0.7573 5.0147 4.5007 3.3883 1.2145 0.7394 0.1189 3.3128 6.8604 98.4698 9.5576 1.6651 1.7786 15.5493 0.4623 4.0659 164.4766 0.5106 31.4164 80.0319 12.5371 0.0009 0.7442 0.3810 54.7997 110.0142 19.7306 23.6411 8.3936 4.7921 27.3591 31.6090 4.3114 34.1555 13.3777 487.4077 553.2743 9.3512 56.1330 2.7620 19.6845 2.9244 0.4128
temp: 298.150 k
press: 1.00000 atm
elementType: 16 8 8 7 7 6 6 6 6 6 6 6 6 1 1 1 1 1 1
symmnumber: 1
zpe: 344859.5 jmol-1
zpe.correction: 0.131350 hartree
zpe.thermalcorrener: 0.140678 hartree
zpe.thermalcorrenthalpy: 0.141622 hartree
zpe.thermalcorrgfe: 0.096171 hartree
zpe.sumelectzpe: -965.538875 hartree
zpe.sumelectthermal: -965.529548 hartree
zpe.sumelectthermalent: -965.528603 hartree
zpe.sumelectthermalfe: -965.574054 hartree
dipole: -2.8440 0.6729 0.0028
dipole: 2.9225
quadrupole: -54.9210 -98.9202 -81.6865
quadrupole: 1.7277 -0.0043 -0.0048
quadrupole: 23.5882 -20.4109 -3.1773 1.7277 -0.0043 -0.0048
hfenergy: -965.6702254 hartree
pointgroup: C01 [X(C8H6N2O2S1)]
dipole: -1.0772094 -0.4019419 -0.0100536 debye
dipolederiv: -0.2902288 -0.0116662 0.0041878 -0.2373194 -0.0829186 -0.0087804 -0.0074494 -0.0112863 0.1372326 -1.7509033 0.1240597 0.0222122 0.2083831 -0.3838179 -0.0080608 0.0276585 -0.0072056 -0.2754885 -0.4875269 -0.1654959 -0.007192 -0.1482131 -1.2757861 -0.0454675 -0.006366 -0.0452531 -0.3672383 -0.7780385 0.2163455 0.0182718 -0.0211346 -0.9473756 -0.0414561 0.0051906 -0.044154 -0.1429755 -1.619731 0.1575402 0.0238942 -0.2489518 -0.4770734 -0.0119063 0.0028762 -0.0164021 -0.1963459 0.3047699 0.1738589 0.008356 0.117801 0.1219039 -0.0099328 0.0056157 -0.0106312 0.2832553 0.7570398 0.0566088 -0.0011826 0.3985862 0.2049936 -0.0105626 0.0167603 -0.0069758 0.330739 2.1475478 -0.0890997 -0.0257809 0.2551192 0.8704569 0.0308687 -0.0082903 0.0348472 0.2236689 0.9298942 0.1284067 -0.0008185 0.0081474 1.6940916 0.0751452 -0.0069926 0.0738418 0.2402981 -0.3129912 -0.3653786 -0.0155774 -0.1926776 -0.6962848 -0.0330539 -0.0066373 -0.0310983 -0.0188357 1.252659 -0.0155169 -0.0159495 0.0671203 0.5204901 0.0313775 -0.0118669 0.0322894 -0.0968628 -0.0290169 -0.0251338 -0.002153 -0.1251926 -0.1272464 0.0003334 -0.0072533 -0.0006849 -0.1061461 -0.2001474 -0.1785072 -0.0106435 0.0536131 0.2961479 0.0312641 0.0012252 0.0337515 -0.3180805 0.0322226 -0.0078181 0.0014109 -0.0552485 0.0206666 0.0657041 0.0452019 0.0777929 -0.0143761 0.0317922 -0.0092203 -0.0034428 -0.0519786 0.0347764 -0.059546 -0.0516957 -0.0724633 -0.0268108 -0.0497852 0.0107734 -0.0641539 -0.0539306 0.0729754 0.0197007 -0.1438226 0.0236628 -0.0282119 -0.0457966 0.0037123 0.0653379 -0.0683226 0.0765708 -0.007251 0.1374928 -0.0127171 -0.0350427 0.1057557 -0.018301 0.0000159 0.0657217 0.0046486 -0.0104949 0.0043791 -0.0096032 0.1924564 0.0024846 0.0148321 0.0032072 0.0284773 0.0727812 -0.0078813 0.0039738 -0.0077106 0.2187645 unknown
polarizability: 182.1634028|9.1953196|124.4412602|-0.9457362|3.5843039|53.4066306 unknown
InChI: InChI=1S/C8H6N2O2S/c11-7-5-1-4-13-6(5)9-8-10(7)2-3-12-8/h1,4H,2-3H2
charge 0 multiplicity 1
19 atoms
S  2.728004 1.691052 0.082765
O  -2.430043 1.448626 0.128105
O  -0.127343 -2.560649 -0.10564
N  -1.188156 -0.470459 0.01363
N  -0.061801 1.660948 0.112476
C  -2.56623 -1.000577 0.002398
C  -3.412136 0.309816 0.077799
C  -1.149657 0.916496 0.085853
C  -0.014086 -1.302483 -0.041976
C  1.202096 -0.49404 -0.013388
C  1.099613 0.917259 0.060767
C  2.562145 -0.969376 -0.052958
C  3.490769 0.05169 -0.01044
H  -2.725179 -1.668357 0.86494
H  -2.745026 -1.57868 -0.919025
H  -4.039707 0.469789 -0.812261
H  -4.02367 0.376247 0.990651
H  2.81542 -2.02996 -0.110779
H  4.577187 -0.014341 -0.026114
