program: Gaussian 09
title: 000195260
version: EM64L-G09RevD.01
frameworkgroup: C1[X(C6H14O6P2)]
method: RPBEPBE
basis: SDD
operation: Freq
keyword: #p
keyword: freq=noraman
keyword: PBEPBE/SDD
title: #p freq=noraman PBEPBE/SDD
converged: YES YES NO NO
title: Mulliken charges:
elementType: P P O O O O O O C C C C C C H H H H H H H H H H H H H H
charge: 1.344175 1.286400 -0.525144 -0.662619 -0.666491 -0.669883 -0.699862 -0.592063 -1.014422 -0.284573 -0.531821 0.536863 -0.811142 -0.727971 0.335334 0.345430 0.268657 0.253160 0.229467 0.222886 0.404796 0.233387 0.225524 0.223676 0.422975 0.402149 0.225893 0.225219
chargesum: 0.00000
title: Mulliken charges with hydrogens summed into heavy atoms:
elementType: P P O O O O O O C C C C C C
charge: 1.344175 1.286400 -0.525144 -0.257823 -0.666491 -0.246908 -0.297713 -0.592063 -0.333657 0.237244 -0.079468 0.536863 -0.128555 -0.276859
polarizability: 1.63917813e+02 -9.94976689e+00 1.32023430e+02 -1.17107060e+01 6.74323960e-01 1.03290713e+02
1716.lowfreq: -15.4363 -11.4747 -6.8726 -5.4227 -0.0008 -0.0001 0.0013 18.0736 40.0866
frequency: -7.0700 17.5634 40.0347 58.1670 78.4177 85.6461 106.2465 152.6262 158.4474 167.1326 183.7693 193.7924 213.3982 219.4410 261.5496 272.6607 285.0865 319.2742 339.3930 354.1797 355.7634 379.7099 392.9308 427.2950 448.1746 514.2175 617.4191 653.5693 696.1910 701.8082 727.8809 741.8370 754.0326 792.4140 797.2725 834.6055 852.3556 920.2833 949.4585 971.7659 981.6036 984.6782 1008.0189 1022.4092 1042.9752 1059.5195 1068.8844 1074.9843 1118.9370 1183.0125 1218.2139 1253.7146 1267.9481 1286.8568 1294.5755 1368.2317 1369.7949 1395.1233 1428.9126 1457.4340 1468.2871 1477.0107 1493.3667 1670.8585 2950.8667 2966.4598 2988.2001 3013.7858 3039.1977 3058.6165 3058.9887 3089.6844 3090.6926 3095.5276 3147.8429 3194.0497 3595.2406 3600.6918
redmass: 3.1710 4.6051 5.9673 2.2862 4.4777 5.3084 3.1399 2.6167 3.2436 1.4737 4.9357 4.0277 4.0214 4.4576 2.6374 2.4401 2.1740 5.9995 6.2838 2.4796 3.7062 3.6029 3.1236 4.8950 2.8019 2.8292 7.8942 7.3836 2.4555 1.5235 5.3199 5.2776 4.2509 1.2432 1.2127 2.7818 2.2694 9.0420 1.3234 1.4983 2.2736 2.3876 1.4294 1.2278 1.5468 4.1441 2.5819 1.8844 1.0630 1.1649 1.2429 1.2279 1.2667 1.2570 2.5706 1.2863 1.0734 1.2290 1.1766 1.0697 1.0592 1.0696 1.0810 5.0564 1.0690 1.0381 1.0620 1.0564 1.0963 1.0592 1.0982 1.0919 1.0707 1.1082 1.1050 1.1141 1.0662 1.0660
irintensity: 0.5953 0.1874 2.4579 0.2741 0.8289 1.9966 2.7310 17.3848 4.3082 2.1040 12.0649 9.5276 11.0053 4.1772 4.2336 85.3768 13.0825 25.7545 63.7471 122.3893 86.0483 23.1456 6.0142 18.3842 9.4519 34.3156 21.2676 18.7767 60.0895 6.6710 170.2823 59.9694 56.0375 112.5131 12.1886 7.4786 182.1620 368.9233 69.3604 4.2415 85.2956 84.2017 93.9813 85.6923 1.9197 129.1144 6.3554 4.6883 4.4994 2.6512 27.0784 216.9688 6.6813 3.6378 17.6976 2.6993 20.7255 22.2149 0.8698 7.7173 23.5030 16.4198 7.3632 25.9261 522.7815 29.1591 13.8118 19.5456 28.3055 4.3905 9.2109 30.7788 5.6312 19.4333 5.6149 22.9273 72.1059 54.6024
temp: 298.150 k
press: 1.00000 atm
elementType: 15 15 8 8 8 8 8 8 6 6 6 6 6 6 1 1 1 1 1 1 1 1 1 1 1 1 1 1
symmnumber: 1
zpe: 543828.4 jmol-1
zpe.correction: 0.207133 hartree
zpe.thermalcorrener: 0.224828 hartree
zpe.thermalcorrenthalpy: 0.225772 hartree
zpe.thermalcorrgfe: 0.160394 hartree
zpe.sumelectzpe: -1369.670713 hartree
zpe.sumelectthermal: -1369.653018 hartree
zpe.sumelectthermalent: -1369.652074 hartree
zpe.sumelectthermalfe: -1369.717452 hartree
dipole: -5.3679 1.6942 -1.3668
dipole: 5.7925
quadrupole: -117.6170 -89.9743 -107.1941
quadrupole: 11.6018 -3.9267 -2.4608
quadrupole: -12.6885 14.9541 -2.2656 11.6018 -3.9267 -2.4608
hfenergy: -1369.8778459 hartree
pointgroup: C01 [X(C6H14O6P2)]
dipole: -2.2103823 0.551542 0.0601355 debye
polarizability: 158.4294191|-0.1678991|127.8049189|-23.6736925|7.6814613|112.9976178 unknown
InChI: InChI=1S/C6H14O6P2/c1-6(2)3-4-12-14(10,11)5-13(7,8)9/h7-8,10H,1,3-5H2,2H3
charge 0 multiplicity 1
28 atoms
P  1.125909 1.5700 0.193956
P  2.922178 -0.637782 -1.064938
O  -0.535886 1.362595 -0.196385
O  1.259436 3.277115 0.108182
O  1.586995 0.855276 1.557779
O  3.466961 -0.744704 0.546679
O  1.383647 -1.471837 -1.100227
O  3.979003 -1.102061 -2.149501
C  2.217594 1.098242 -1.242172
C  -1.244097 0.112503 0.254238
C  -2.70903 0.3083 -0.161292
C  -3.583462 -0.879354 0.236313
C  -3.284435 -2.206927 -0.440121
C  -4.588755 -0.739031 1.140389
H  1.656377 1.16878 -2.185417
H  3.065054 1.803439 -1.257132
H  -0.764695 -0.747065 -0.245083
H  -1.137499 0.017082 1.349521
H  -3.087791 1.234987 0.305014
H  -2.739138 0.451404 -1.259723
H  0.648589 3.786321 0.699494
H  -4.033029 -2.972127 -0.174887
H  -3.277331 -2.096293 -1.542168
H  -2.288409 -2.597087 -0.152525
H  2.852626 -0.241745 1.199055
H  1.455555 -2.455989 -1.187721
H  -4.800508 0.223008 1.621871
H  -5.231159 -1.581847 1.420901
