program: Gaussian 09
title: 000017222
version: EM64L-G09RevD.01
frameworkgroup: C1[X(C12H9N3O2)]
method: RPBEPBE
basis: SDD
operation: Freq
keyword: #p
keyword: freq=noraman
keyword: PBEPBE/SDD
title: #p freq=noraman PBEPBE/SDD
converged: YES YES NO NO
title: Mulliken charges:
elementType: O O N N N C C C C C C C C C C C C H H H H H H H H H
charge: -0.211694 -0.211691 -0.095033 -0.099088 0.023347 0.354035 0.387605 -0.349696 -0.349611 -0.333337 -0.333448 0.340153 -0.380646 -0.380487 -0.193305 -0.193404 -0.238963 0.251502 0.251441 0.290291 0.290271 0.239572 0.239484 0.233710 0.233689 0.235303
chargesum: 0.00000
title: Mulliken charges with hydrogens summed into heavy atoms:
elementType: O O N N N C C C C C C C C C C C C
charge: -0.211694 -0.211691 -0.095033 -0.099088 0.023347 0.354035 0.387605 -0.098194 -0.098169 -0.043046 -0.043177 0.340153 -0.141074 -0.141003 0.040405 0.040284 -0.003661
polarizability: 3.17935815e+02 4.89684000e-04 1.56918031e+02 -7.13244509e+00 1.17420857e-02 6.42918531e+01
1716.lowfreq: -214.8642 -49.8864 -8.1216 -0.0009 -0.0007 -0.0006 2.2126 2.7162 38.2999
frequency: -214.8631 -49.8803 38.2993 39.7648 67.1958 101.5839 165.9900 200.1990 239.2294 300.9037 330.5082 384.9985 394.0644 405.2149 460.4234 485.3938 527.6074 532.3106 562.8796 611.4583 624.3872 646.5536 668.1101 694.0118 718.9446 742.9948 766.2604 803.4171 819.6873 831.3027 833.6255 866.9368 908.4086 964.2501 975.9711 983.4684 985.0752 990.5386 1000.4921 1022.4618 1077.9601 1092.7832 1106.5221 1132.9540 1172.9907 1173.2584 1182.3235 1203.5184 1221.5702 1287.3493 1308.4458 1354.1047 1374.2678 1392.3009 1416.3942 1433.6796 1461.0235 1463.1201 1475.1722 1583.1979 1592.8708 1595.9539 1599.3372 3133.2033 3140.1987 3152.5906 3160.6340 3161.2172 3161.3948 3173.3207 3185.6417 3188.1427
redmass: 9.2272 3.8885 7.9759 5.9548 9.2097 6.4091 8.2093 8.2349 5.9530 5.2238 5.8216 7.9746 2.9167 3.0138 4.1460 9.5071 5.9900 3.4710 7.1311 6.5188 7.2311 5.4532 4.4567 2.0034 3.7696 2.9156 4.7196 4.1082 3.3496 1.2452 1.2454 2.1150 1.5956 1.3769 1.3323 1.3572 5.7490 1.3389 2.9471 2.2199 1.5628 3.4651 1.2765 3.4429 1.3556 1.0518 1.1739 3.7703 6.1794 1.2747 1.3525 5.9979 7.8615 9.7406 4.2690 2.3026 2.2459 2.3256 11.0730 7.0912 7.2075 6.2874 6.1215 1.0848 1.0880 1.0925 1.0964 1.0902 1.0896 1.1018 1.0956 1.0968
irintensity: 0.0458 0.0060 0.7051 0.3248 0.0170 3.1687 4.3061 3.0399 0.8965 0.1841 3.1336 0.8593 0.0001 0.0011 3.3897 2.6572 0.1756 46.3984 2.2683 0.0079 0.0812 30.8600 40.1742 40.9024 3.5932 41.2476 12.0377 26.2891 75.7342 0.0480 0.0031 58.0359 11.6806 0.0257 4.6347 0.0160 2.6369 0.2226 11.9818 7.8915 9.1345 19.6953 25.7552 28.9834 100.3473 0.2861 2.9451 55.6392 430.4700 0.6134 0.1871 65.1317 6.6272 34.2157 20.1122 14.2539 0.2052 37.2387 9.4167 0.1972 8.8817 164.4062 5.8861 1.1991 2.5782 11.7344 16.6915 9.7089 0.2373 20.3098 0.0350 4.9568
temp: 298.150 k
press: 1.00000 atm
elementType: 8 8 7 7 7 6 6 6 6 6 6 6 6 6 6 6 6 1 1 1 1 1 1 1 1 1
symmnumber: 1
zpe: 489585.9 jmol-1
zpe.correction: 0.186473 hartree
zpe.thermalcorrener: 0.198974 hartree
zpe.thermalcorrenthalpy: 0.199918 hartree
zpe.thermalcorrgfe: 0.145794 hartree
zpe.sumelectzpe: -776.054523 hartree
zpe.sumelectthermal: -776.042023 hartree
zpe.sumelectthermalent: -776.041079 hartree
zpe.sumelectthermalfe: -776.095202 hartree
dipole: 6.5131 0.0003 -0.4844
dipole: 6.5311
quadrupole: -118.5288 -84.7949 -104.4217
quadrupole: 0.0086 0.7611 0.0326
quadrupole: -15.9470 17.7869 -1.8399 0.0086 0.7611 0.0326
hfenergy: -776.2409965 hartree
pointgroup: C01 [X(C12H9N3O2)]
dipole: -2.5627872 0.000034 -0.1859236 debye
dipolederiv: -0.878176 0.2014773 -0.0352038 0.4228493 -0.6686781 0.017634 -0.050411 0.0147763 -0.2361539 -0.8780539 -0.2011304 -0.0369374 -0.422619 -0.6684645 -0.0213905 -0.053884 -0.0185096 -0.2364644 -1.0227323 0.0003866 -0.086645 -0.0073417 -0.1131134 -0.0002743 -0.7375833 -0.0001062 -0.0786832 0.1282496 -0.0003701 -0.0931543 0.0090323 -0.1108166 0.0003243 0.216304 0.0001827 -0.026 2.3119612 -0.0005094 0.1240031 -0.0003864 1.0796171 0.0038053 0.1610239 0.003811 0.2031486 1.1112223 -0.0005482 0.0661661 0.000726 0.1718031 0.0006648 0.4333731 0.0007396 0.0386569 -1.0956666 0.0002522 -0.0587156 0.0005044 -0.0319209 -0.0003176 -0.0758893 -0.0003505 0.0358039 -0.5572993 0.100144 0.0008039 0.2782358 0.0220818 0.0468374 0.0263529 -0.0015656 -0.1331141 -0.5576807 -0.1001284 -0.0001555 -0.2791776 0.0219136 -0.0453998 0.0284319 0.0028062 -0.1336203 0.3996261 -0.0606811 0.0345832 0.3235443 0.0034814 0.0066914 0.0574566 -0.0063092 -0.0826511 0.4003047 0.060467 0.0350776 -0.3237717 0.0035565 -0.006 0.0539111 0.0069312 -0.0825046 0.736145 0.0004858 0.0529356 -0.0013826 0.0692594 -0.0004002 0.0980867 -0.0004433 0.0067396 -0.280816 -0.0255722 0.0196554 0.0058406 0.0207692 -0.0397383 -0.0197761 0.0008171 -0.1452315 -0.2811061 0.0257382 0.0193838 -0.0054585 0.0206671 0.0380752 -0.0137719 -0.0023236 -0.1456828 0.0647395 0.042581 0.0291057 0.0036614 0.1133244 0.0135102 0.0347621 0.0069225 -0.1268644 0.0655225 -0.0423624 0.0294291 -0.0033665 0.1132159 -0.0157496 0.0343047 -0.0090631 -0.1265741 0.0420632 0.0000683 0.0327023 -0.0005975 -0.1282012 -0.0001492 0.0118143 -0.0001313 -0.166475 0.0537907 -0.0760114 -0.015835 -0.0637839 0.0033147 -0.0081703 -0.0220676 -0.0020123 0.1541196 0.0535116 0.0762333 -0.0152297 0.0640845 0.0032984 0.0068661 -0.0215965 0.0007581 0.1541814 0.0892399 0.0590378 -0.0019908 0.0072507 0.0662538 0.0033106 -0.0206911 0.0036716 0.1691528 0.0892881 -0.0589873 -0.0025351 -0.0071502 0.0662557 -0.004186 -0.0211815 -0.0043771 0.1690688 0.0695277 0.0915999 -0.0225284 0.0779911 -0.0166792 0.0131844 -0.0300935 0.0072373 0.1567541 0.0692322 -0.091922 -0.0217082 -0.0785271 -0.0167898 -0.0114941 -0.0296477 -0.0056184 0.1569017 -0.0011915 -0.0811799 -0.0099866 -0.0988806 -0.0567233 -0.0095527 -0.0086918 -0.0074116 0.156064 -0.0010374 0.0810343 -0.0107943 0.0988903 -0.0566575 0.0115645 -0.0101915 0.0092576 0.155879 -0.1306648 -0.0001029 -0.0324263 -0.0001673 0.0892323 0.0003543 -0.0403446 0.0003106 0.1635491 unknown
polarizability: 317.9609176|-0.0069946|156.9180169|6.6711294|0.037629|64.2667642 unknown
InChI: InChI=1S/C12H9N3O2/c16-15(17)12-8-6-11(7-9-12)14-13-10-4-2-1-3-5-10/h1-9H
charge 0 multiplicity 1
26 atoms
O  5.53955 -1.142029 0.132181
O  5.539078 1.141122 0.141919
N  -0.743424 0.000941 -0.505499
N  -1.506131 0.001428 0.533189
N  4.934604 -0.00036 0.085571
C  0.678351 0.000258 -0.264949
C  3.461186 -0.00013 -0.040233
C  1.377103 -1.233108 -0.222699
C  1.376579 1.233502 -0.211964
C  2.7778 -1.235427 -0.102972
C  2.777295 1.235367 -0.092377
C  -2.933402 0.000393 0.242296
C  -3.625433 -1.230588 0.169946
C  -3.624854 1.23094 0.158078
C  -5.026466 -1.223175 -0.009047
C  -5.025919 1.222459 -0.020662
C  -5.730871 -0.000621 -0.10454
H  0.822438 -2.174423 -0.280133
H  0.821509 2.175053 -0.261093
H  3.347729 -2.166731 -0.052544
H  3.346842 2.166438 -0.033956
H  -3.075697 -2.173861 0.253458
H  -3.074668 2.174722 0.232419
H  -5.565461 -2.17441 -0.075923
H  -5.564485 2.173261 -0.096541
H  -6.817352 -0.001023 -0.240524
