program: Gaussian 09
title: 000195297
version: EM64L-G09RevD.01
frameworkgroup: C1[X(C22H24N4O5)]
method: RPBEPBE
basis: SDD
operation: Freq
keyword: #p
keyword: freq=noraman
keyword: PBEPBE/SDD
title: #p freq=noraman PBEPBE/SDD
converged: YES YES NO NO
title: Mulliken charges:
elementType: O O O O O N N N N C C C C C C C C C C C C C C C C C C C C C C H H H H H H H H H H H H H H H H H H H H H H H H
charge: -0.276329 -0.258162 -0.271805 -0.304423 -0.298391 -0.179995 -0.146210 -0.199495 -0.402004 -0.376287 -0.410312 -0.433754 -0.357160 0.477054 0.126913 -0.505459 -0.390462 0.149290 0.320524 -0.362852 0.328142 0.109227 -0.514584 0.161730 -0.388212 -0.647837 0.227149 -0.333845 0.193015 -0.530669 -0.530058 0.233035 0.227744 0.229314 0.221848 0.274113 0.235000 0.262901 0.236130 0.283354 0.233010 0.246922 0.277699 0.262778 0.361032 0.236336 0.288166 0.235824 0.254281 0.219963 0.234759 0.255484 0.227993 0.232517 0.255057
chargesum: 0.00000
title: Mulliken charges with hydrogens summed into heavy atoms:
elementType: O O O O O N N N N C C C C C C C C C C C C C C C C C C C C C C
charge: -0.276329 -0.258162 -0.271805 -0.304423 -0.298391 -0.179995 -0.146210 -0.199495 -0.040972 0.084492 0.040850 0.075359 0.141870 0.477054 0.126913 -0.222105 -0.157452 0.149290 0.320524 -0.115931 0.328142 0.109227 -0.236885 0.161730 -0.125434 0.112490 0.227149 -0.079564 0.193015 0.179538 0.185509
polarizability: 4.52218168e+02 -4.38549683e+00 3.15825757e+02 8.15642482e+00 -1.04639088e+01 1.54907755e+02
1716.lowfreq: -10.2312 -3.8664 -0.0007 -0.0004 0.0010 2.2107 6.2443 18.2336 23.2031
frequency: -3.8530 18.0917 23.1932 31.4030 50.7534 66.8515 76.2367 84.1919 89.2909 101.5895 107.4463 114.2039 149.3435 155.2579 162.5205 164.9116 167.7941 182.0123 187.5749 202.9708 218.8188 224.4318 239.4929 256.8054 263.3062 285.2728 294.3466 326.1568 333.7178 354.6728 361.7306 381.4059 391.4343 399.9772 413.2300 429.8926 436.5993 456.9565 487.0632 489.6364 507.7290 519.5841 542.7242 549.8054 568.4184 591.2594 624.0901 631.3496 643.1097 673.8179 675.0637 696.5619 698.4791 707.5079 730.2707 734.6630 748.2373 759.7343 783.7362 804.2529 811.7630 833.3062 846.4308 856.4376 888.7633 898.0743 913.8668 920.3711 935.8743 943.0490 962.6311 963.6297 970.5736 978.0883 1011.4508 1043.1518 1067.3376 1077.4841 1080.3980 1089.8584 1111.3780 1114.2297 1124.2916 1128.5970 1130.7110 1152.6499 1153.3798 1161.6241 1174.7646 1180.5356 1188.3578 1196.1083 1211.1892 1231.0518 1242.6413 1245.3804 1259.7356 1270.6850 1275.7334 1280.6357 1321.3180 1339.9142 1341.7315 1355.3095 1359.0740 1360.8325 1366.6322 1368.2857 1377.1263 1386.9844 1392.0101 1408.3215 1425.4623 1433.2211 1440.5260 1457.7787 1459.8720 1460.2502 1473.2964 1476.5885 1479.0557 1483.7836 1487.3328 1487.7234 1489.3349 1492.9072 1494.2857 1514.2786 1547.3933 1568.7343 1570.2006 1607.6317 1622.7859 1640.9313 1651.1036 2932.0857 2939.2466 2959.7494 2973.1752 2976.9976 2986.4770 2987.7570 3009.3873 3043.6326 3056.9436 3070.0680 3071.9216 3074.1684 3106.1151 3124.8045 3125.7196 3126.5056 3143.2674 3151.5485 3151.9255 3166.1642 3172.0409 3176.2274 3530.6599
redmass: 5.1811 6.0145 5.1811 5.9546 4.7173 3.8810 4.7720 5.4821 4.0194 3.8058 3.1180 3.0566 2.9580 2.2047 3.1702 1.2385 2.3770 4.2517 3.0922 4.4422 1.1532 3.6448 4.1992 4.4577 3.6886 5.0132 3.0348 2.4978 5.2490 4.0982 4.2727 7.5005 5.7746 5.8981 5.9398 3.8408 5.5825 5.3424 3.4805 3.7500 5.0394 5.9074 3.8953 3.0353 5.7229 5.8074 3.9028 2.9375 5.1200 2.8409 4.5266 5.9572 5.9459 5.1249 6.1373 5.7044 2.2405 3.8155 2.5034 1.9453 3.3588 4.4803 1.5665 1.5747 3.8187 1.5422 1.5897 3.2137 1.3714 8.0989 2.1694 1.4893 3.8171 2.4614 2.3173 2.2599 2.7633 2.1174 2.2235 2.6722 1.2533 1.2416 1.7053 1.3957 2.0505 1.3673 1.3084 2.1622 2.4563 2.2561 2.1726 1.6164 1.3851 1.8489 2.0315 1.7193 2.2066 1.8126 1.6391 1.9509 3.2069 2.3400 1.3003 2.2439 2.4472 1.5252 1.6115 1.6878 3.4535 2.8918 3.3599 4.9029 1.1884 1.3008 1.3095 1.0558 2.1123 1.2335 1.1812 1.0602 1.1130 2.1324 1.1525 1.0579 1.2551 1.1692 1.0496 3.0834 8.9457 7.1068 7.9048 6.6193 9.7863 5.9420 6.0667 1.0684 1.0684 1.0698 1.0313 1.0307 1.0640 1.0354 1.0978 1.0913 1.0994 1.1034 1.1027 1.1044 1.0902 1.1028 1.1030 1.0983 1.0916 1.0880 1.0871 1.0906 1.0973 1.0949 1.0768
irintensity: 0.4014 0.7605 1.5974 1.8482 2.2089 0.4146 1.1980 1.5942 5.1682 5.3373 4.5658 4.2594 1.5789 1.6460 0.4549 0.1877 4.3128 4.7020 2.0599 0.6671 0.3087 7.9958 9.7394 9.8458 8.5092 0.1233 3.3491 12.9769 13.0307 0.3414 7.6091 22.2022 3.6806 2.2236 4.2185 2.4597 12.8760 2.8518 0.3052 6.3108 6.9211 5.0746 4.3812 4.3698 6.1373 23.4349 8.4912 5.2392 14.9514 10.4891 1.8543 0.2658 0.9624 18.7230 12.8379 11.7546 38.9141 2.4020 90.2813 29.5718 46.9378 5.2262 25.1667 1.1837 11.7398 11.1780 32.8410 4.8185 3.1151 84.9590 37.7077 2.1385 50.5271 52.1451 47.3271 6.3799 10.6705 1.1913 6.5738 86.8000 18.1470 8.1466 25.4819 3.5688 18.2113 0.2848 2.7690 6.4217 83.8774 36.5331 6.0653 6.4293 79.2289 62.4277 35.9138 94.6160 107.0401 39.6554 51.4246 8.5733 75.9548 104.0594 3.2550 13.4730 17.4470 70.1382 5.6397 25.5977 471.0482 47.1160 55.2823 100.8617 7.8735 19.2869 11.7341 11.8565 88.0446 2.4658 58.4973 12.7390 84.2113 101.8369 33.2275 30.3599 94.2784 3.7248 18.6202 439.6188 222.7821 132.9639 18.0509 14.1913 311.6956 710.8542 100.6849 64.2503 37.2982 56.5084 70.8051 69.7491 26.4644 45.3436 33.4414 26.2686 12.2991 31.8836 25.8137 22.1490 6.8250 19.2619 24.1095 0.5298 5.1208 2.7485 16.2457 11.2434 5.3569 11.2778 71.7089
temp: 298.150 k
press: 1.00000 atm
elementType: 8 8 8 8 8 7 7 7 7 6 6 6 6 6 6 6 6 6 6 6 6 6 6 6 6 6 6 6 6 6 6 1 1 1 1 1 1 1 1 1 1 1 1 1 1 1 1 1 1 1 1 1 1 1 1
symmnumber: 1
zpe: 1139417.9 jmol-1
zpe.correction: 0.433981 hartree
zpe.thermalcorrener: 0.462014 hartree
zpe.thermalcorrenthalpy: 0.462958 hartree
zpe.thermalcorrgfe: 0.374533 hartree
zpe.sumelectzpe: -1445.624101 hartree
zpe.sumelectthermal: -1445.596068 hartree
zpe.sumelectthermalent: -1445.595124 hartree
zpe.sumelectthermalfe: -1445.683550 hartree
dipole: 2.0693 -2.0860 2.3195
dipole: 3.7435
quadrupole: -195.2255 -182.9347 -185.7750
quadrupole: 47.5138 1.0679 -5.3280
quadrupole: -7.2471 5.0436 2.2034 47.5138 1.0679 -5.3280
hfenergy: -1446.0580822 hartree
pointgroup: C01 [X(C22H24N4O5)]
dipole: 0.7967735 0.7586205 -0.9791914 debye
polarizability: 451.8206375|3.4382036|313.7477647|-13.7351837|-21.0250067|157.3832772 unknown
InChI: InChI=1S/C22H24N4O5/c1-24-17-6-5-15(13-16(17)20(27)23-22(24)29)25-8-10-26(11-9-25)21(28)14-4-7-18(30-2)19(12-14)31-3/h4-7,12-13,23H,8-11H2,1-3H3
charge 0 multiplicity 1
55 atoms
O  3.493331 3.302665 0.644047
O  -3.80739 -3.099625 0.605838
O  -8.239751 -1.723373 0.230995
O  5.211049 -2.359479 0.759456
O  7.517435 -1.481337 -0.830164
N  -1.016975 1.218703 -0.180751
N  1.830706 1.787577 0.064935
N  -6.574645 -0.079613 -0.0533
N  -5.997743 -2.336708 0.406228
C  -0.005446 0.141846 -0.215344
C  -0.519178 2.607584 -0.224589
C  1.323399 0.677511 -0.772486
C  0.807159 2.754434 0.543005
C  -2.380869 0.908352 -0.148157
C  3.171622 2.147271 0.211572
C  -2.828025 -0.416881 0.107461
C  -3.390751 1.899462 -0.379554
C  -4.201046 -0.737036 0.13053
C  -5.197568 0.25966 -0.088071
C  -4.758721 1.585544 -0.342972
C  4.238506 1.133262 -0.116064
C  -4.601549 -2.136244 0.398909
C  4.212752 -0.183365 0.40814
C  -7.020866 -1.389092 0.194518
C  5.359711 1.553028 -0.87531
C  -7.603983 0.951861 -0.278356
C  5.28229 -1.072777 0.177128
C  6.432038 0.669055 -1.107983
C  6.415508 -0.637577 -0.571434
C  5.212781 -3.482594 -0.20875
C  8.270631 -1.910663 0.374465
H  -0.356847 -0.673253 -0.878026
H  0.157762 -0.296142 0.793261
H  -1.250153 3.274053 0.266693
H  -0.397783 2.967103 -1.269798
H  2.062395 -0.134735 -0.811035
H  1.165313 1.027701 -1.814472
H  1.210439 3.77605 0.426073
H  0.631844 2.593034 1.624747
H  -2.136259 -1.237994 0.314893
H  -3.108092 2.929127 -0.617357
H  -5.48182 2.383675 -0.530164
H  3.384083 -0.535436 1.032482
H  5.394829 2.580716 -1.249498
H  -6.327334 -3.290093 0.585944
H  -7.528384 1.750281 0.481369
H  -8.585928 0.463636 -0.19537
H  -7.501522 1.393372 -1.285873
H  7.309986 0.97786 -1.68401
H  4.300564 -3.445194 -0.834108
H  5.208184 -4.396004 0.404756
H  6.109132 -3.450771 -0.853625
H  8.740105 -1.032686 0.856178
H  9.047355 -2.5957 0.002863
H  7.609123 -2.423951 1.09493
