program: Gaussian 09
title: 000195256
version: EM64L-G09RevD.01
frameworkgroup: C1[X(C12H16N2O8)]
method: RPBEPBE
basis: SDD
operation: Freq
keyword: #p
keyword: freq=noraman
keyword: PBEPBE/SDD
title: #p freq=noraman PBEPBE/SDD
converged: NO YES NO NO
title: Mulliken charges:
elementType: O O O O O O O O N N C C C C C C C C C C C C H H H H H H H H H H H H H H H H
charge: -0.291526 -0.470343 -0.479731 -0.453899 -0.426525 -0.319612 -0.239414 -0.162676 -0.331117 -0.223474 -0.169499 0.017542 -0.160388 -0.159568 -0.149059 -0.492239 0.282605 -0.512374 0.233996 0.189430 -0.247941 -0.234230 0.226678 0.234840 0.288540 0.279284 0.260280 0.272612 0.250476 0.381300 0.364676 0.374265 0.365435 0.380956 0.270816 0.285129 0.282162 0.282592
chargesum: 0.00000
title: Mulliken charges with hydrogens summed into heavy atoms:
elementType: O O O O O O O O N N C C C C C C C C C C C C
charge: -0.291526 -0.089043 -0.105466 -0.088464 -0.045569 -0.319612 -0.239414 -0.162676 0.033559 -0.223474 0.057179 0.252382 0.128152 0.119715 0.111221 0.030849 0.282605 0.043571 0.233996 0.189430 0.034221 0.048362
polarizability: 1.80496525e+02 -7.66346617e+00 1.68781736e+02 1.76998874e+01 -1.15981009e+01 1.40247783e+02
1716.lowfreq: -15.8542 -10.9958 0.0007 0.0011 0.0011 4.0573 11.6276 23.3042 35.6544
frequency: 2.0453 23.0981 35.6147 52.3722 80.5509 99.9474 116.1664 142.7112 148.2133 161.0267 192.8768 195.8253 205.5382 232.7735 254.5171 275.8178 278.3585 297.2229 311.4435 333.8659 367.0693 394.0644 400.0836 410.2285 432.0627 443.7656 460.9046 474.5282 504.7561 547.5639 550.9064 558.2412 584.1142 616.6046 620.0950 622.3185 687.3270 689.1296 734.8067 748.1575 779.0905 792.0677 804.3681 817.0335 824.1257 845.6311 873.6139 901.8298 915.1849 941.0270 950.3362 955.3033 999.4974 1001.8956 1012.4329 1030.7272 1033.9719 1048.1903 1065.4638 1084.4219 1094.7737 1110.3901 1123.7470 1128.7651 1172.1105 1217.1567 1225.2890 1235.1632 1263.4517 1268.2659 1284.0677 1285.2827 1294.9786 1295.8700 1307.6904 1329.7044 1337.4262 1339.6184 1347.7422 1359.7806 1364.7284 1370.6286 1372.3830 1414.3840 1416.9023 1447.9623 1448.5452 1541.6373 1578.6001 1601.8188 1626.4327 1679.4088 2949.8043 2979.7259 3012.3828 3018.5067 3053.5651 3066.1068 3084.6992 3091.8744 3107.0443 3166.7775 3210.8383 3237.9501 3323.0910 3373.6157 3511.0926 3569.6701
redmass: 6.7409 7.5084 8.9017 7.0732 6.5871 7.8975 6.3412 7.2441 8.3743 7.4190 8.7355 6.8784 7.0350 4.4740 4.0798 4.9762 3.7116 4.1624 3.5299 4.2400 6.5225 2.0280 4.9525 1.6826 3.0634 1.3473 4.6614 3.7973 5.8053 4.5165 4.4396 4.6546 6.1989 3.4406 1.5203 2.0428 7.2544 4.9997 6.3693 4.4915 4.5220 1.1208 1.6351 1.6547 2.1832 3.4084 2.9941 2.7334 4.5828 1.3135 4.9100 4.1360 5.1159 3.2806 3.0426 2.1431 2.8692 3.7209 3.2198 3.6566 2.2872 2.8104 3.0066 2.3491 1.1337 1.2566 1.2663 1.3681 1.2338 1.7887 1.4320 1.3577 1.2307 1.2173 1.6516 1.2258 1.8278 1.2400 1.4129 1.3571 1.3277 1.9712 1.6190 1.4327 1.2154 1.1137 1.1015 1.7868 6.9775 7.6778 6.1457 10.9707 1.0821 1.0855 1.0635 1.0613 1.0864 1.0865 1.0894 1.1036 1.0996 1.0710 1.0900 1.1107 1.0684 1.0823 1.0655 1.0660
irintensity: 0.6738 0.3989 0.3588 3.9201 3.1173 2.9337 4.9198 13.5415 2.0864 24.0825 2.3409 10.0496 8.3268 2.5516 5.3539 14.6936 21.7237 0.7615 1.8678 22.5776 32.6376 19.7868 19.6721 67.6017 18.9826 101.9935 9.9105 4.9889 17.9922 9.0411 4.7909 36.8383 17.1376 6.6474 96.9476 20.3980 29.3695 9.8290 3.5361 54.4504 19.1925 129.8853 159.1053 35.6960 78.7745 19.7000 22.4606 9.0010 167.6478 0.0893 57.3213 46.8239 180.6754 50.3395 72.1120 3.3416 56.2712 28.7135 22.4744 24.3495 18.4250 14.8273 26.6312 0.1138 13.5424 7.6013 65.6018 13.2028 11.3111 16.5448 2.1976 8.3302 3.4460 6.4307 9.6099 17.2230 47.8494 15.2145 18.6009 5.0394 20.5185 49.7153 97.9086 10.4451 71.6561 58.3229 5.4168 277.6686 7.3004 91.3088 444.3501 29.8395 13.9276 37.8119 13.4856 20.3560 11.1849 16.8361 38.9854 4.6529 2.8792 560.4186 0.3608 0.0280 127.5747 202.0180 11.6080 16.2270
temp: 298.150 k
press: 1.00000 atm
elementType: 8 8 8 8 8 8 8 8 7 7 6 6 6 6 6 6 6 6 6 6 6 6 1 1 1 1 1 1 1 1 1 1 1 1 1 1 1 1
symmnumber: 1
zpe: 757262.3 jmol-1
zpe.correction: 0.288426 hartree
zpe.thermalcorrener: 0.309229 hartree
zpe.thermalcorrenthalpy: 0.310173 hartree
zpe.thermalcorrgfe: 0.235548 hartree
zpe.sumelectzpe: -1176.471946 hartree
zpe.sumelectthermal: -1176.451142 hartree
zpe.sumelectthermalent: -1176.450198 hartree
zpe.sumelectthermalfe: -1176.524823 hartree
dipole: 5.2871 2.2564 -0.3161
dipole: 5.7572
quadrupole: -125.2622 -133.8599 -131.3954
quadrupole: 17.2982 -0.5899 5.6736
quadrupole: 4.9103 -3.6874 -1.2229 17.2982 -0.5899 5.6736
hfenergy: -1176.7603715 hartree
pointgroup: C01 [X(C12H16N2O8)]
dipole: -2.1300232 0.7681961 -0.0576728 debye
polarizability: 176.0757467|6.6178948|169.0939168|20.5149721|13.8792089|144.3563816 unknown
InChI: InChI=1S/C12H16N2O8/c15-6(4-14-7(16)1-2-8(14)17)13-3-5-9(18)10(19)11(20)12(21)22-5/h1-2,5,9-13,18-21H,3-4H2
charge 0 multiplicity 1
38 atoms
O  2.6545 1.319998 1.212733
O  1.470769 -1.700534 -0.80019
O  4.617593 -1.372564 -0.921993
O  3.334938 2.029024 -1.40288
O  4.775915 0.120306 1.480231
O  -0.595581 -2.351338 0.775997
O  -2.847919 1.72311 0.836113
O  -4.0758 -1.977534 -1.778875
N  -0.707932 -0.125347 1.456643
N  -3.289762 -0.36256 -0.209544
C  2.369808 -0.850011 -0.03494
C  1.660701 0.366743 0.611862
C  3.479498 -0.422203 -1.027393
C  4.090477 0.969703 -0.730212
C  4.079702 1.176075 0.797046
C  0.720476 0.00331 1.79547
C  -1.268258 -1.28971 1.007599
C  -2.803798 -1.282444 0.830919
C  -3.314235 1.045199 -0.122631
C  -3.908106 -0.788697 -1.432517
C  -3.977537 1.544655 -1.377168
C  -4.313714 0.474755 -2.14887
H  2.842428 -1.42088 0.794552
H  1.081996 0.90734 -0.166054
H  3.055397 -0.420277 -2.046885
H  5.115925 0.994681 -1.134816
H  4.509848 2.134411 1.127779
H  0.819652 0.817041 2.533445
H  1.060992 -0.935107 2.269143
H  0.784504 -2.125883 -0.190951
H  -1.324249 0.695543 1.562761
H  4.290391 -2.278056 -1.156023
H  2.713937 2.427704 -0.736713
H  4.948156 -0.644125 0.85297
H  -3.290623 -1.032037 1.791782
H  -3.099222 -2.298873 0.525389
H  -4.118233 2.607921 -1.569844
H  -4.797736 0.452059 -3.125036
