program: Gaussian 09
title: 000195236
version: EM64L-G09RevD.01
frameworkgroup: C1[X(C17H16Cl2N4O5)]
method: RPBEPBE
basis: SDD
operation: Freq
keyword: #p
keyword: freq=noraman
keyword: PBEPBE/SDD
title: #p freq=noraman PBEPBE/SDD
converged: YES YES NO NO
title: Mulliken charges:
elementType: Cl Cl O O O O O N N N N C C C C C C C C C C C C C C C C C H H H H H H H H H H H H H H H H
charge: -0.001169 -0.032908 -0.443229 -0.270475 -0.297598 -0.260693 -0.215459 -0.160106 -0.147607 -0.225811 -0.086173 -0.389202 0.121707 -0.079798 0.068790 0.207886 -0.224428 -0.324501 0.211983 -0.608500 -0.598841 0.160156 0.406632 -0.291792 -0.318579 -0.212884 -0.230672 -0.088953 0.268353 0.248301 0.253430 0.283412 0.253401 0.251555 0.271916 0.251586 0.248603 0.260563 0.255561 0.254671 0.360696 0.317444 0.285874 0.266858
chargesum: 0.00000
title: Mulliken charges with hydrogens summed into heavy atoms:
elementType: Cl Cl O O O O O N N N N C C C C C C C C C C C C C C C C C
charge: -0.001169 -0.032908 -0.082533 -0.270475 -0.297598 -0.260693 -0.215459 -0.160106 -0.147607 -0.225811 -0.086173 0.127452 0.121707 0.173631 0.068790 0.207886 0.058984 0.180455 0.211983 0.163604 0.171955 0.160156 0.406632 -0.291792 -0.001135 0.072990 0.036187 -0.088953
polarizability: 3.09361707e+02 -8.71368794e+00 3.06873815e+02 7.28169843e+00 2.26187309e+01 1.41858175e+02
1716.lowfreq: -4.9925 -3.8652 -2.3572 -0.0002 0.0010 0.0015 11.8544 18.2290 22.3727
frequency: 11.4855 18.1949 22.3334 32.8535 43.3122 46.4563 59.4434 72.8169 84.8860 94.7834 106.7621 115.0458 143.9015 149.9134 158.2286 163.1306 170.5440 175.4693 201.2658 210.3179 223.1323 265.4152 271.3645 291.1786 294.4989 307.1793 336.7523 343.4211 368.1817 371.7563 377.6679 387.9712 402.0006 415.9781 433.2159 439.7621 459.5310 494.3908 508.1021 536.2022 541.8907 565.2650 611.8843 644.8135 654.1182 667.8027 669.3841 703.9779 722.4543 742.4049 748.1688 751.2686 781.7679 791.2323 813.9862 833.2776 840.9726 867.7500 902.4380 917.3655 924.8078 957.3593 980.2822 1005.1032 1008.8057 1022.9889 1046.3427 1051.4236 1068.6689 1088.8623 1100.1884 1129.4163 1131.9178 1150.2954 1164.1456 1166.5231 1202.9874 1206.5615 1219.7819 1224.8524 1235.2500 1254.1797 1263.9111 1270.3178 1300.1582 1314.0309 1327.5458 1346.6098 1353.7588 1358.0222 1371.8973 1377.2867 1386.3675 1409.2978 1418.7326 1426.7049 1447.3796 1458.4125 1467.6598 1471.9646 1472.9691 1478.2127 1478.4729 1502.4190 1560.0014 1570.2052 1586.6989 1613.2845 1638.0117 1643.0923 3000.6768 3010.4846 3015.7169 3039.8587 3042.0668 3101.2279 3107.8219 3114.7156 3124.5998 3142.1408 3142.8421 3169.5129 3184.5488 3186.9547 3245.0404 3579.9313
redmass: 11.1544 7.0426 8.1817 6.4322 10.1476 6.8907 7.4401 6.9220 1.0853 3.1202 1.9124 1.8763 4.3839 5.9924 6.4403 5.8688 8.9912 12.6800 3.4709 1.6969 2.4696 5.8143 6.9391 3.2606 5.0540 4.0927 6.2418 3.8435 6.8654 6.3766 10.5496 4.5839 4.0865 3.5640 7.6994 3.4228 4.5727 5.8971 7.8978 6.3678 5.7271 5.0215 4.6277 5.9655 7.3625 5.1693 8.7456 10.8566 6.5885 8.7549 4.9959 5.1483 5.3987 7.2572 1.4625 2.8472 1.4219 1.4104 2.9322 3.0642 4.1142 6.2285 1.3799 3.8807 3.5021 3.0820 2.6433 2.4908 2.7328 3.9337 2.5177 1.3034 1.3012 1.3808 2.0155 2.4546 1.3114 1.9452 3.1580 3.1177 2.0024 1.7435 3.8248 1.3770 7.3895 1.2525 1.3282 2.5195 3.6743 1.5383 2.4639 6.1768 1.6831 1.7453 1.2934 1.2524 1.7253 2.3652 1.1317 1.0563 1.2671 1.0461 1.0718 2.5886 8.3454 8.2338 7.0068 11.0925 10.7976 9.9050 1.0853 1.0335 1.0329 1.0592 1.0594 1.1027 1.1022 1.1054 1.1070 1.1015 1.1022 1.0896 1.0947 1.0964 1.0992 1.0669
irintensity: 0.5182 0.1722 0.5918 1.5202 1.7388 0.4335 0.6074 0.8884 0.0243 0.0924 2.1959 1.9910 9.2365 0.7834 1.9539 0.2751 2.7736 5.1808 18.0052 104.7310 52.0960 0.7217 0.7848 3.8805 0.4121 11.4725 1.5172 17.8134 4.4045 11.5519 7.1865 7.7070 6.4189 33.0057 6.2720 21.3913 15.7309 11.8932 12.0458 3.6322 3.9999 13.1492 11.9456 6.2574 7.0926 18.6940 0.1105 8.8677 14.1968 11.7037 22.2747 4.8201 11.6188 40.0808 14.8139 0.4134 40.4860 18.2255 9.9979 12.4434 2.0704 28.1661 7.4128 212.8154 195.0010 31.3234 8.0943 24.1251 156.1924 12.8404 5.4529 0.3256 0.1089 3.5886 25.6097 46.6425 41.3051 17.9035 28.7154 201.1520 28.7668 21.4353 23.5439 19.5264 21.7627 8.9696 26.9983 21.7219 18.1872 19.6496 19.6437 11.1744 18.4046 44.0848 33.4362 57.0017 173.6345 71.6485 6.3027 15.2866 14.9440 14.4952 3.4449 154.5681 55.0650 11.5625 155.8818 783.9307 69.3415 468.9930 11.7310 34.1957 21.4116 21.4262 14.2239 15.3720 13.9578 2.1405 6.4652 0.3657 1.1716 28.5236 8.9909 6.1114 3.3573 9.3979
temp: 298.150 k
press: 1.00000 atm
elementType: 17 17 8 8 8 8 8 7 7 7 7 6 6 6 6 6 6 6 6 6 6 6 6 6 6 6 6 6 1 1 1 1 1 1 1 1 1 1 1 1 1 1 1 1
symmnumber: 1
zpe: 832860.4 jmol-1
zpe.correction: 0.317220 hartree
zpe.thermalcorrener: 0.344435 hartree
zpe.thermalcorrenthalpy: 0.345379 hartree
zpe.thermalcorrgfe: 0.255392 hartree
zpe.sumelectzpe: -2170.654897 hartree
zpe.sumelectthermal: -2170.627682 hartree
zpe.sumelectthermalent: -2170.626738 hartree
zpe.sumelectthermalfe: -2170.716725 hartree
dipole: 2.6720 -0.5512 1.0473
dipole: 2.9224
quadrupole: -183.7982 -186.4321 -175.1422
quadrupole: -13.7364 -0.9059 -2.4466
quadrupole: -2.0074 -4.6413 6.6486 -13.7364 -0.9059 -2.4466
hfenergy: -2170.9721168 hartree
pointgroup: C01 [X(C17H16Cl2N4O5)]
dipole: -1.0210563 0.3077379 0.4297379 debye
polarizability: 307.4783744|-10.0842809|305.7597523|-13.3923797|-29.1877772|144.8555706 unknown
InChI: InChI=1S/C17H16Cl2N4O5/c1-21-14-13(15(25)22(2)17(21)27)23(8-20-14)6-10(24)7-28-16(26)11-4-3-9(18)5-12(11)19/h3-5,8,10,24H,6-7H2,1-2H3
charge 0 multiplicity 1
44 atoms
Cl 5.866231 1.259205 -1.261785
Cl 5.281397 -4.124079 -0.237278
O  -0.991478 3.741722 1.162169
O  2.051012 1.656756 0.981472
O  -0.569101 -0.955223 0.487533
O  -4.879524 -2.859622 0.329222
O  2.977483 2.393893 -1.036823
N  -1.904611 1.588197 -0.753321
N  -4.657284 -0.653325 -0.440387
N  -2.74797 -1.885048 0.393165
N  -4.149287 1.64553 -1.207241
C  -0.510892 2.040569 -0.584137
C  -2.431281 0.34198 -0.366976
C  -0.243395 2.511537 0.864296
C  -3.80338 0.413337 -0.667995
C  -1.801462 -0.826842 0.190167
C  -2.972299 2.327423 -1.238173
C  1.231788 2.887996 1.078616
C  -4.148093 -1.85599 0.10388
C  -6.092859 -0.548665 -0.772358
C  -2.252689 -3.162212 0.958533
C  2.863873 1.508835 -0.16067
C  3.503404 0.159098 -0.151233
C  4.805258 -0.085106 -0.661269
C  2.75464 -0.949533 0.3349
C  5.358921 -1.380684 -0.683449
C  3.280196 -2.255596 0.308523
C  4.579198 -2.448555 -0.199917
H  0.156707 1.202235 -0.83642
H  -0.328708 2.877166 -1.280034
H  -0.509328 1.693639 1.564172
H  -2.854943 3.339978 -1.616409
H  1.370027 3.267552 2.102008
H  1.574652 3.634138 0.340634
H  -6.565323 -1.506719 -0.512447
H  -6.21633 -0.340521 -1.848036
H  -6.553701 0.272719 -0.199047
H  -1.175746 -3.044028 1.144961
H  -2.43411 -3.984856 0.247911
H  -2.786247 -3.391885 1.894911
H  -1.925568 3.517835 1.400307
H  1.739679 -0.783306 0.706646
H  6.369174 -1.546171 -1.064593
H  2.68937 -3.100574 0.670173
