program: Gaussian 09
title: 000195205
version: EM64L-G09RevD.01
frameworkgroup: C1[X(C21H14O8)]
method: RPBEPBE
basis: SDD
operation: Freq
keyword: #pfreq=noraman
keyword: PBEPBE/SDD
title: #p freq=noraman PBEPBE/SDD
converged: YES YES NO NO
title: Mulliken charges:
elementType: O O O O O O O O C C C C C C C C C C C C C C C C C C C C C H H H H H H H H H H H H H H
charge: -0.403761 -0.322211 -0.186138 -0.388448 -0.372168 -0.242793 -0.412566 -0.342652 -0.011366 0.082936 0.346503 0.591339 0.019892 -0.712739 0.265895 0.182955 0.351833 0.030029 -0.312183 -0.678306 0.002446 0.094545 0.209677 -0.578631 -0.768426 0.376215 -0.596511 0.157885 -0.535658 0.299846 0.283715 0.319786 0.258456 0.251023 0.255285 0.239257 0.387402 0.394494 0.360190 0.393708 0.225735 0.225634 0.257877
chargesum: 0.00000
title: Mulliken charges with hydrogens summed into heavy atoms:
elementType: O O O O O O O O C C C C C C C C C C C C C C C C C C C C C
charge: -0.016360 -0.322211 -0.186138 0.006045 -0.011978 -0.242793 -0.018858 -0.342652 -0.011366 0.082936 0.346503 0.591339 0.019892 -0.412892 0.265895 0.182955 0.351833 0.030029 -0.312183 -0.394591 0.002446 0.094545 0.209677 -0.258845 -0.003662 0.376215 -0.357254 0.157885 0.173587
polarizability: 6.55281737e+02 -1.25319214e+01 2.85975533e+02 -6.50546330e-01 -9.29658377e-01 1.05698685e+02
1716.lowfreq: -8.0260 -0.9308 -0.0008 -0.0006 -0.0003 2.5107 21.7107 32.9623 49.0098
frequency: 21.7100 32.8980 49.0089 62.1449 75.8247 92.3507 98.3751 116.6274 127.7370 150.3145 172.6935 177.5363 185.6645 201.5866 221.3697 231.0750 237.7762 241.9370 278.9266 299.4750 313.5597 327.5429 341.8442 354.7081 362.3824 385.6619 402.7898 406.8282 422.8905 434.3162 454.6792 475.5755 479.3244 487.4875 522.1325 536.0407 549.2163 555.7424 562.8910 586.2757 593.1110 598.6116 611.9174 620.3501 631.7565 657.9420 662.6950 696.9986 706.6382 716.6375 748.0517 758.6590 780.5415 805.9985 814.3962 823.1618 849.0656 871.8096 892.5082 915.2825 935.7116 944.0599 967.7308 991.9556 1008.7266 1022.1421 1026.9388 1036.6072 1075.9565 1085.0468 1108.7039 1110.0193 1132.8686 1143.3664 1153.0308 1160.8522 1173.8315 1176.1718 1189.2377 1218.3063 1254.8688 1267.2594 1300.8900 1319.9832 1332.1583 1363.6069 1382.0130 1387.3926 1401.6072 1409.8846 1410.9712 1415.2601 1423.2166 1434.4877 1439.5419 1455.9506 1468.2163 1468.5626 1476.3328 1479.0187 1499.0454 1533.1377 1541.2805 1559.0021 1573.5633 1591.8276 1599.6874 1629.6476 1644.4195 1963.2750 2937.5906 2966.2060 3011.0035 3058.7076 3098.7401 3134.2183 3137.5122 3154.0905 3158.3835 3170.6667 3178.5202 3496.7813 3534.0466
redmass: 6.6921 6.5491 6.4692 5.5874 6.4284 4.4156 5.2579 6.4208 2.9144 1.9250 4.7078 4.5655 2.1033 7.1089 6.3123 5.1045 3.6231 1.9858 6.0888 4.9086 6.7862 5.0102 7.6358 6.1408 6.0217 7.8802 3.1580 1.3121 8.4995 5.6901 8.5439 5.9839 5.9112 5.8436 7.9208 5.4027 5.2733 5.3384 5.6354 3.1136 4.2264 2.0780 5.3702 5.2675 3.5185 3.8523 3.8871 6.1650 4.5172 4.9751 4.8300 6.8233 7.3307 3.8743 4.5795 1.9247 2.5694 1.3550 1.3507 7.8815 1.6762 5.7045 1.9522 5.5933 5.0460 2.6047 3.1018 2.1878 3.0322 2.0253 3.7377 1.2589 2.5632 1.0981 1.6478 1.8444 1.7821 1.9386 1.6521 1.9987 1.9887 2.5268 3.4776 6.1783 5.7405 3.8346 4.3533 2.5913 4.0896 2.5311 2.4595 5.4679 2.9980 2.8904 1.5172 1.1491 1.1659 1.0580 1.2389 3.3020 4.3963 5.7523 8.6577 4.1872 3.7808 4.0774 5.8060 6.8795 4.8057 1.0924 1.0690 1.0329 1.0460 1.1045 1.0872 1.0943 1.0962 1.0919 1.0991 1.0926 1.0923 1.0635 1.0657
irintensity: 3.1422 0.0468 0.0227 2.4778 1.2156 1.3148 1.2036 1.1521 0.3746 1.2822 3.2546 3.0769 0.0051 0.0989 0.1818 1.3066 3.4032 0.8100 11.6102 2.3497 5.7628 16.1607 10.3437 10.2507 8.9192 15.6297 4.1272 87.5321 7.9574 12.2337 6.4942 17.1750 10.9481 1.7560 4.5217 19.4050 28.3554 44.3526 36.5799 6.8150 12.8334 63.7003 3.3487 8.9457 16.1687 33.6360 31.1605 23.1989 35.4630 9.1348 1.5370 1.1218 13.3809 0.5905 5.6732 38.3449 1.5971 165.4981 15.1242 0.2570 3.5359 142.4321 42.3370 5.7594 187.9092 48.7061 106.0662 25.5972 15.8173 1.9257 132.5074 0.1303 316.2243 111.4899 99.3005 68.0618 96.6062 53.0082 85.2742 64.2954 167.9866 89.8068 455.7802 713.3168 133.7900 26.9787 120.9941 46.2952 117.7653 332.8814 19.9580 107.3710 184.8072 232.4538 87.2111 36.9012 7.4316 15.1111 26.6213 74.0504 45.7223 220.8347 242.9228 112.4241 79.0581 53.4971 614.9296 36.4040 680.1685 287.7095 645.8911 78.2786 1.3877 40.9866 7.2351 24.9777 10.1411 0.1038 8.8496 1.1587 6.2791 94.8236 35.1526
temp: 298.150 k
press: 1.00000 atm
elementType: 8 8 8 8 8 8 8 8 6 6 6 6 6 6 6 6 6 6 6 6 6 6 6 6 6 6 6 6 6 1 1 1 1 1 1 1 1 1 1 1 1 1 1
symmnumber: 1
zpe: 798608.4 jmol-1
zpe.correction: 0.304174 hartree
zpe.thermalcorrener: 0.328282 hartree
zpe.thermalcorrenthalpy: 0.329227 hartree
zpe.thermalcorrgfe: 0.250686 hartree
zpe.sumelectzpe: -1408.451554 hartree
zpe.sumelectthermal: -1408.427445 hartree
zpe.sumelectthermalent: -1408.426501 hartree
zpe.sumelectthermalfe: -1408.505042 hartree
dipole: -5.6211 3.9000 -0.0562
dipole: 6.8418
quadrupole: -95.2176 -179.3992 -167.3738
quadrupole: -0.9661 -0.8569 0.1211
quadrupole: 52.1126 -32.0690 -20.0436 -0.9661 -0.8569 0.1211
hfenergy: -1408.7557276 hartree
pointgroup: C01 [X(C21H14O8)]
dipole: 2.1978985 -1.5523495 -0.0712092 debye
polarizability: 654.9360744|-16.1529502|285.7328312|6.4286822|9.4632094|106.28705 unknown
InChI: InChI=1S/C21H14O8/c1-7-14-8(4-12(22)15(7)21(27)28)3-10-17(19(14)25)20(26)16-11(18(10)24)5-9(29-2)6-13(16)23/h3-6,22-23,25,27H,1-2H3
charge 0 multiplicity 1
43 atoms
O  -1.067354 -2.421617 -0.163373
O  1.33517 -2.633251 -0.183133
O  1.928065 2.863235 0.149838
O  -5.455385 2.450634 0.005472
O  3.969911 -2.891769 -0.174564
O  6.622484 1.227894 0.092281
O  -6.331177 -1.625253 -0.559571
O  -7.036344 0.50515 -0.130319
C  0.324057 -0.471697 -0.023691
C  -2.191957 -0.256936 0.011232
C  0.446675 0.959884 0.04668
C  -2.005603 1.187719 0.037216
C  -0.98412 -1.073025 -0.049837
C  -0.689911 1.759205 0.066484
C  -3.526545 -0.804672 0.031369
C  2.844866 -0.733662 -0.04863
C  2.990084 0.69561 0.039234
C  1.501755 -1.332096 -0.089018
C  1.79145 1.600015 0.08352
C  -3.126715 2.049398 0.055465
C  -4.643411 0.093031 -0.043847
C  -4.427339 1.538399 0.00404
C  4.0500 -1.504986 -0.090304
C  4.249654 1.312552 0.083535
C  -3.741555 -2.296265 0.210379
C  5.422855 0.52422 0.041834
C  5.323493 -0.882518 -0.045918
C  -6.05093 -0.312296 -0.214208
C  7.877473 0.466792 0.052631
H  -0.567874 2.846327 0.104569
H  -2.996129 3.133881 0.099825
H  4.313195 2.401627 0.148755
H  -2.988865 -2.708631 0.897239
H  -4.749754 -2.521645 0.57565
H  -3.598457 -2.837492 -0.742736
H  6.222677 -1.508379 -0.080578
H  -0.016077 -2.783127 -0.197831
H  -6.343858 1.937986 -0.00525
H  4.877227 -3.292869 -0.193249
H  -7.317724 -1.703802 -0.68077
H  7.968168 -0.103763 -0.891469
H  7.956524 -0.217457 0.919089
H  8.670998 1.225249 0.105256
