program: Gaussian 09
title: 000195162
version: EM64L-G09RevD.01
frameworkgroup: C1[X(C14H19NO5S)]
method: RPBEPBE
basis: SDD
operation: Freq
keyword: #p
keyword: freq=noraman
keyword: PBEPBE/SDD
title: #p freq=noraman PBEPBE/SDD
converged: YES YES NO NO
title: Mulliken charges:
elementType: S O O O O O N C C C C C C C C C C C C C C H H H H H H H H H H H H H H H H H H H
charge: 0.987335 -0.276096 -0.401694 -0.270863 -0.507086 -0.498155 -0.193858 -0.041717 -0.374397 -0.036867 -0.327110 0.263260 -0.674757 -0.690461 -0.070183 -0.252348 -0.206230 0.447263 -0.388996 -0.342465 -0.798718 0.238386 0.227672 0.261512 0.249615 0.282625 0.220664 0.219511 0.211286 0.240951 0.232445 0.225792 0.211185 0.290538 0.320433 0.246498 0.266362 0.226401 0.244115 0.238154
chargesum: 0.00000
title: Mulliken charges with hydrogens summed into heavy atoms:
elementType: S O O O O O N C C C C C C C C C C C C C C
charge: 0.987335 -0.276096 -0.401694 -0.270863 -0.507086 -0.498155 -0.193858 0.196668 0.114787 0.212749 0.176179 0.263260 -0.003009 -0.021039 -0.070183 0.038190 0.114203 0.447263 -0.142498 -0.076103 -0.090049
polarizability: 1.92268701e+02 -1.00807578e+01 2.35776051e+02 1.24982775e+01 4.64591749e+00 1.63415098e+02
1716.lowfreq: -6.6492 -1.9246 -0.0015 -0.0008 -0.0004 9.4202 14.7253 27.4465 30.2311
frequency: 12.9022 27.3906 30.1197 40.7852 45.7027 55.9153 72.8284 91.4516 116.3601 128.4817 141.0517 156.0238 180.8471 200.1497 212.8060 223.8488 231.1752 251.1231 267.0269 279.3810 286.6172 312.5013 332.7628 361.4032 396.6359 409.0061 415.0276 429.5977 441.2378 455.8710 507.5672 547.9609 560.2795 587.7658 618.4418 620.0133 654.4519 683.6442 700.4793 754.8895 777.5320 823.1449 825.5441 828.7094 846.7755 865.8672 891.1058 922.1008 926.2435 941.2644 963.2977 963.9737 973.7116 981.8668 989.7432 994.9744 1040.3971 1047.0009 1049.3047 1050.5700 1065.2694 1106.3061 1124.7538 1140.1471 1171.5978 1190.8436 1192.8714 1214.4623 1219.6020 1234.9890 1243.4157 1293.2359 1301.8289 1319.6371 1328.1312 1349.0903 1364.3065 1380.1943 1382.0425 1392.4468 1395.9932 1400.7292 1403.0548 1437.5023 1465.8106 1469.0709 1469.8798 1470.2107 1475.9929 1480.9215 1484.4035 1495.2380 1590.3125 1590.9611 1696.3803 2958.1390 2981.6939 2982.7201 2983.2571 2988.1482 3007.7763 3022.3304 3028.5305 3057.7775 3063.7293 3075.3438 3084.2512 3089.1679 3093.4813 3094.4462 3139.8878 3151.9690 3167.3037 3176.0910
redmass: 3.8402 3.4237 4.8327 3.8964 1.0803 5.0564 5.4120 5.1511 5.0378 6.3163 5.2540 5.0142 5.4192 3.7801 1.3930 2.4101 7.0675 1.0973 6.6975 5.4484 3.1725 2.6955 3.6475 3.9496 6.1003 2.9052 3.1268 3.1254 5.8189 7.0227 3.4676 4.7404 2.8044 6.1029 7.3587 7.3668 3.6360 11.0258 3.4319 4.8689 4.9409 3.8827 2.0671 3.1862 1.2415 3.0419 3.3208 1.2728 2.3773 1.3735 2.7425 2.0968 3.4899 1.9216 2.0117 1.8546 2.1631 2.4353 1.9275 1.9602 1.8178 2.0920 1.3065 2.3011 2.1039 1.1341 1.3114 1.9143 3.1020 1.7074 1.8712 1.2545 1.2575 1.4129 1.7466 1.4389 1.2911 1.2180 4.9617 2.8530 1.3257 1.2947 1.5043 1.0730 1.0465 1.0683 1.2865 1.6127 1.1009 1.0459 1.0645 1.0818 6.1146 6.5865 11.6867 1.0591 1.0362 1.0381 1.0427 1.0541 1.0872 1.0850 1.1018 1.1028 1.0960 1.0995 1.0983 1.1008 1.0997 1.1001 1.0894 1.0901 1.0957 1.0969
irintensity: 0.5940 0.4630 3.0664 1.0333 0.7738 1.0228 6.1123 0.8017 0.9117 1.4492 2.7437 1.3325 0.2434 2.4378 3.4085 10.0431 9.4565 0.8820 4.5369 5.9153 1.8413 0.9242 2.2509 4.2580 19.0475 0.0980 8.7757 5.9467 15.5636 74.0022 112.1614 3.5760 2.5928 24.4936 9.5375 8.4330 13.3070 32.4368 0.6867 5.7473 4.6474 48.2637 93.7037 37.2216 6.1242 41.5495 13.6759 0.8422 39.0940 1.6593 59.0592 34.9553 100.7808 5.4638 3.3597 5.3849 7.5730 44.4911 5.7567 18.6922 17.4077 5.1743 5.9077 17.0490 24.9834 3.0770 38.7936 82.0905 5.7133 23.5045 99.1294 4.8852 1.7472 3.2951 30.9206 8.4681 24.3059 24.7841 3.2929 14.2034 2.6266 16.2564 30.0361 23.2276 0.3918 15.9289 2.6234 14.7292 16.3702 17.2027 0.9435 24.2880 19.9596 1.5378 360.1490 19.6358 17.8506 20.5187 5.8257 33.2911 31.0549 0.8293 25.3907 45.1791 15.1135 2.7822 59.9863 20.1052 15.9740 37.1425 10.8609 3.2141 4.1564 10.1809
temp: 298.150 k
press: 1.00000 atm
elementType: 16 8 8 8 8 8 7 6 6 6 6 6 6 6 6 6 6 6 6 6 6 1 1 1 1 1 1 1 1 1 1 1 1 1 1 1 1 1 1 1
symmnumber: 1
zpe: 819635.3 jmol-1
zpe.correction: 0.312183 hartree
zpe.thermalcorrener: 0.334726 hartree
zpe.thermalcorrenthalpy: 0.335671 hartree
zpe.thermalcorrgfe: 0.257592 hartree
zpe.sumelectzpe: -1372.062710 hartree
zpe.sumelectthermal: -1372.040166 hartree
zpe.sumelectthermalent: -1372.039222 hartree
zpe.sumelectthermalfe: -1372.117301 hartree
dipole: 4.0095 3.5330 -3.0533
dipole: 6.1548
quadrupole: -124.0917 -123.4277 -142.1922
quadrupole: -23.6706 -6.2845 -5.5344
quadrupole: 5.8122 6.4762 -12.2884 -23.6706 -6.2845 -5.5344
hfenergy: -1372.3748929 hartree
pointgroup: C01 [X(C14H19N1O5S1)]
dipole: -0.7823721 -2.0840312 -0.9530075 debye
polarizability: 208.8269491|-23.8243111|215.9430971|-4.6687612|-17.5573822|166.6898036 unknown
InChI: InChI=1S/C14H19NO5S/c1-10(2)15-8-12(20-14(15)16)9-19-21(17,18)13-6-4-11(3)5-7-13/h4-7,10,12H,8-9H2,1-3H3
charge 0 multiplicity 1
40 atoms
S  1.146842 2.693147 -0.668041
O  -1.542586 0.729024 1.273286
O  -0.549362 2.018175 -1.274132
O  -0.987467 -1.429629 2.01238
O  0.832654 3.545204 0.678504
O  1.835616 3.384516 -1.953851
N  -2.324458 -1.057489 0.079928
C  -2.396533 1.297015 0.186673
C  -2.675929 0.098093 -0.765515
C  -2.403046 -2.46855 -0.368248
C  -1.67917 2.482743 -0.464477
C  -1.574328 -0.696122 1.187874
C  -1.360617 -2.766381 -1.473715
C  -3.837801 -2.827332 -0.80749
C  2.035377 1.093885 -0.271595
C  3.010178 0.652204 -1.180192
C  1.688642 0.410063 0.905501
C  3.369516 -1.292479 0.297532
C  3.679651 -0.553821 -0.875172
C  2.366247 -0.797074 1.174816
C  4.100146 -2.581698 0.621803
H  -3.326558 1.656933 0.667633
H  -3.733353 0.068241 -1.079669
H  -2.027012 0.152621 -1.660826
H  -2.140893 -3.059812 0.52917
H  -1.324146 3.180504 0.323501
H  -2.373187 3.02755 -1.134254
H  -1.386646 -3.838456 -1.73945
H  -1.567595 -2.186766 -2.392318
H  -0.341786 -2.520184 -1.126402
H  -4.564901 -2.595832 -0.009492
H  -3.901355 -3.906758 -1.03176
H  -4.131904 -2.280519 -1.722976
H  3.237579 1.229459 -2.081737
H  0.911282 0.783529 1.578086
H  4.449584 -0.924168 -1.561249
H  2.090239 -1.360865 2.072185
H  4.669081 -2.959224 -0.244557
H  4.816484 -2.428561 1.451436
H  3.397218 -3.370588 0.944112
