program: Gaussian 09
title: 000195150
version: EM64L-G09RevD.01
frameworkgroup: C1[X(C9H20N2O5S)]
method: RPBEPBE
basis: SDD
operation: Freq
keyword: #p
keyword: freq=noraman
keyword: PBEPBE/SDD
title: #p freq=noraman PBEPBE/SDD
converged: YES YES NO NO
title: Mulliken charges:
elementType: S O O O O O N N C C C C C C C C C H H H H H H H H H H H H H H H H H H H H
charge: 1.091500 -0.444239 -0.294745 -0.637699 -0.563961 -0.691161 -0.112066 -0.362550 -0.334611 -0.123021 -0.546176 -0.568056 -0.583800 -0.585346 0.215436 -0.295685 -0.645680 0.331001 0.241211 0.257936 0.293251 0.231289 0.252360 0.233969 0.346780 0.225323 0.351108 0.221597 0.257712 0.260326 0.228228 0.343292 0.349861 0.260401 0.240572 0.273002 0.282639
chargesum: 0.00000
title: Mulliken charges with hydrogens summed into heavy atoms:
elementType: S O O O O O N N C C C C C C C C C
charge: 1.091500 -0.100947 -0.294745 -0.637699 -0.563961 -0.691161 -0.112066 -0.012688 0.237601 0.134916 0.230725 0.238016 0.246617 -0.096792 0.215436 0.205287 -0.090038
polarizability: 1.80260785e+02 -1.69523309e+00 1.49582836e+02 1.63565918e-01 3.04205263e+00 1.31681622e+02
1716.lowfreq: -6.7108 -0.0019 0.0012 0.0013 4.1570 12.4323 32.4280 60.3570 71.8665
frequency: 31.9042 60.2848 71.8148 84.3740 101.4997 105.8535 115.7382 151.2410 168.4168 184.6378 195.8483 203.5138 233.1468 245.4300 260.7064 272.0164 275.9873 301.1869 318.6953 332.3836 337.4745 349.4870 354.6463 356.9896 379.5226 412.0830 420.5436 437.2979 479.3047 484.2030 509.9861 558.0522 624.0308 696.8563 718.5000 733.2254 766.9535 822.2470 837.6422 846.9094 873.3135 910.3733 912.5159 921.8593 942.0429 958.7132 969.7979 985.6990 1018.8269 1041.7054 1055.1590 1076.0527 1103.0484 1119.0341 1122.7698 1167.6452 1184.1917 1187.1354 1201.0816 1221.1856 1236.5757 1263.7688 1266.8721 1290.8665 1309.3675 1325.7399 1338.2861 1348.8155 1370.2548 1393.2306 1411.3881 1418.7117 1430.0389 1445.2585 1450.6360 1457.4699 1458.1829 1467.8382 1472.1356 1474.5355 1491.9867 1496.5006 1517.2447 1570.0056 1624.5388 2954.5552 2983.2490 2983.5598 3003.1596 3005.9230 3024.3855 3042.9906 3053.6325 3058.7904 3079.8864 3081.5043 3088.9287 3105.8320 3127.7684 3129.3288 3135.9059 3140.0025 3149.8182 3154.9525 3552.1150
redmass: 4.9041 6.6002 6.9682 4.6891 3.0015 4.3324 5.5507 3.6431 3.7076 3.9032 3.7634 1.3618 4.6613 3.0928 1.1528 1.9626 4.5417 1.4451 1.0597 3.9147 4.7139 7.1668 2.5461 6.8414 3.5285 2.2779 3.2290 2.5399 2.2892 4.4848 2.8448 4.2581 3.7699 5.0078 8.8464 3.7772 5.3597 2.1129 1.8005 1.9939 2.7754 4.6321 3.3956 2.8122 3.8691 2.9167 2.0615 1.9363 1.6566 2.1653 1.2072 1.9727 1.9343 1.6795 1.5610 1.3638 1.4607 1.2895 1.2114 1.6450 1.6298 1.8243 1.2680 1.5033 1.6205 1.3652 1.3569 1.6729 1.1821 1.2372 1.1092 1.1213 1.1387 1.1121 1.0492 1.0933 1.0809 1.1016 1.0785 1.0644 1.0597 1.0773 1.0528 1.9153 2.7433 1.0433 1.0512 1.0506 1.0613 1.0603 1.0332 1.0940 1.0855 1.0614 1.1043 1.1017 1.0958 1.1009 1.0863 1.1034 1.1044 1.1042 1.1092 1.1037 1.0663
irintensity: 5.5558 1.2181 5.7485 11.9974 2.1340 5.2494 24.0556 10.3505 1.7925 4.9138 3.9699 2.6562 6.3177 6.7897 7.2122 18.3636 10.0747 101.7990 6.1644 1.8804 21.1949 24.4377 5.5860 16.4114 19.8794 0.6907 6.6321 11.3263 4.9714 22.6319 8.3266 19.4112 6.8943 84.9033 45.3819 7.1925 200.6129 40.0398 58.0945 53.1963 33.9376 109.7577 40.8764 50.8970 12.1002 68.1233 59.2627 15.7675 26.4025 15.1527 0.2441 3.6660 2.7042 3.6643 19.3316 8.8583 9.5266 44.5503 3.3399 1.6284 30.8184 2.8864 1.4828 6.2466 22.2038 28.6042 3.7262 31.3025 7.2188 9.1928 9.6318 28.8618 5.6085 6.5232 2.1367 23.0038 3.7626 35.7195 13.4674 41.7405 23.8136 10.7592 45.3874 302.6539 87.1252 113.0722 65.5712 39.6034 13.2576 73.8891 20.6031 4.5504 9.2895 8.5845 8.1555 17.5012 16.8536 16.6814 353.5034 38.2220 7.3537 19.7343 2.6726 5.2539 11.1423
temp: 298.150 k
press: 1.00000 atm
elementType: 16 8 8 8 8 8 7 7 6 6 6 6 6 6 6 6 6 1 1 1 1 1 1 1 1 1 1 1 1 1 1 1 1 1 1 1 1
symmnumber: 1
zpe: 795512.6 jmol-1
zpe.correction: 0.302995 hartree
zpe.thermalcorrener: 0.322900 hartree
zpe.thermalcorrenthalpy: 0.323844 hartree
zpe.thermalcorrgfe: 0.255855 hartree
zpe.sumelectzpe: -1237.052639 hartree
zpe.sumelectthermal: -1237.032734 hartree
zpe.sumelectthermalent: -1237.031790 hartree
zpe.sumelectthermalfe: -1237.099779 hartree
dipole: -8.6228 -1.1023 0.7112
dipole: 8.7220
quadrupole: -111.9609 -116.8611 -112.1686
quadrupole: 31.2525 9.8953 -11.6488
quadrupole: 1.7026 -3.1975 1.4949 31.2525 9.8953 -11.6488
hfenergy: -1237.3556342 hartree
pointgroup: C01 [X(C9H20N2O5S1)]
dipole: -3.2399708 -0.2902731 1.0925117 debye
polarizability: 174.4285495|-0.6652501|133.2793868|-12.2221245|6.5272837|153.8173061 unknown
InChI: InChI=1S/C9H20N2O5S/c1-11(2,3)7-8(12)6-9(13)10-4-5-17(14,15)16/h8,10,12H,4-7H2,1-3H3
charge 0 multiplicity 1
37 atoms
S  1.022604 -0.04045 -2.129405
O  -3.731169 2.018504 1.30052
O  -0.120352 0.140899 2.589223
O  0.406505 1.512268 -1.933374
O  1.6480 -0.371191 -3.590703
O  -0.074709 -1.158639 -1.545647
N  -3.152782 -0.712874 -0.493257
N  0.94281 1.091156 0.735142
C  -2.418522 0.636632 -0.306135
C  -2.500086 1.221378 1.119827
C  -4.599816 -0.634186 -0.033491
C  -3.097288 -1.061845 -1.984046
C  -2.402208 -1.811499 0.267257
C  -1.21641 2.019659 1.461438
C  -0.062306 1.017789 1.663939
C  1.922271 -0.004972 0.593164
C  2.480491 -0.051949 -0.831538
H  -1.382266 0.438086 -0.632028
H  -2.868806 1.341621 -1.027881
H  -2.587932 0.433201 1.886925
H  -4.638831 -0.351925 1.027133
H  -5.069097 -1.618716 -0.190543
H  -5.120985 0.136804 -0.620364
H  -3.606226 -0.267992 -2.553131
H  -2.028096 -1.132117 -2.261722
H  -3.60765 -2.02645 -2.137485
H  -1.378997 -1.851103 -0.14621
H  -2.932168 -2.763819 0.105374
H  -2.374731 -1.571112 1.340034
H  -1.39438 2.551814 2.412427
H  -0.984802 2.759817 0.671759
H  -3.613828 2.900687 0.863647
H  0.778736 1.647914 -0.135816
H  1.425781 -0.958913 0.85084
H  2.763036 0.125402 1.303141
H  3.041658 -0.976272 -1.033971
H  3.059153 0.839392 -1.122242
