program: Gaussian 09
title: 000195185
version: EM64L-G09RevD.01
frameworkgroup: C1[X(C22H36OS)]
method: RPBEPBE
basis: SDD
operation: Freq
keyword: #p
keyword: freq=noraman
keyword: PBEPBE/SDD
title: #p freq=noraman PBEPBE/SDD
converged: YES YES NO NO
title: Mulliken charges:
elementType: S O C C C C C C C C C C C C C C C C C C C C C C H H H H H H H H H H H H H H H H H H H H H H H H H H H H H H H H H H H H
charge: -0.050896 -0.445096 0.410921 -0.133963 -0.191379 -0.082252 -0.074171 -0.530511 0.265061 -0.561085 -0.546332 -0.503718 -0.498010 -0.858826 -0.099588 0.491934 -0.516140 -0.489704 -0.832829 -0.671451 -0.451965 -0.048993 -0.789531 -0.730659 0.209351 0.242854 0.191282 0.245866 0.199449 0.210809 0.211159 0.228082 0.223316 0.211426 0.206953 0.222191 0.220018 0.213908 0.213805 0.229788 0.228899 0.217094 0.206696 0.215372 0.206980 0.224045 0.225552 0.225097 0.202964 0.226620 0.216364 0.222584 0.197589 0.270162 0.296796 0.218028 0.220667 0.208582 0.330222 0.098613
chargesum: 0.00000
title: Mulliken charges with hydrogens summed into heavy atoms:
elementType: S O C C C C C C C C C C C C C C C C C C C C C C
charge: 0.047717 -0.114874 0.410921 0.075388 0.051474 0.109030 0.171695 -0.120254 0.265061 -0.121843 -0.111590 -0.074573 -0.064084 -0.186334 0.117506 0.491934 -0.094072 -0.282724 -0.158134 -0.241867 -0.013017 0.148596 -0.222573 -0.083382
polarizability: 3.03347826e+02 -2.88300044e+00 2.33208317e+02 1.99917495e+00 -2.67317012e+00 1.99245986e+02
1716.lowfreq: -18.9914 -9.6461 -8.4074 0.0006 0.0009 0.0014 23.9095 32.3158 51.6060
frequency: 23.7310 32.0433 51.5901 59.5750 80.6567 98.7392 105.3080 137.0005 166.5797 171.3970 178.3863 189.7748 203.0599 210.1045 214.2064 236.6545 238.3004 238.8365 254.7427 264.4826 279.4068 289.8299 294.6605 308.8280 314.4074 328.7652 335.1381 362.9287 380.2281 402.7020 416.2843 441.4836 448.0314 451.7997 469.0543 478.1653 499.9936 527.2804 543.4839 583.8606 593.4087 606.0230 623.8226 644.8255 689.8587 710.6275 728.1262 764.2624 796.0685 802.2576 818.3422 830.6532 838.6004 843.6109 864.8449 884.4716 890.1321 908.6514 925.3179 926.4680 935.1717 947.9072 958.9550 964.5898 981.7824 991.0544 999.0655 1006.6515 1016.8215 1021.3825 1025.5282 1031.0425 1043.1834 1048.2465 1075.0561 1077.4838 1086.1877 1097.7349 1098.5338 1112.6446 1124.4238 1131.1349 1135.7008 1141.2000 1149.6678 1152.5302 1166.8544 1180.0558 1189.1401 1195.2524 1200.9392 1212.8323 1218.2990 1229.0940 1240.2049 1250.4050 1251.8955 1257.5423 1261.9447 1271.5639 1272.9059 1283.1198 1284.6106 1290.1659 1295.9527 1303.3216 1315.8921 1320.9580 1322.7593 1326.0936 1328.6015 1336.0583 1337.3025 1342.5771 1347.0796 1354.3752 1358.0070 1369.2361 1383.3076 1387.4381 1389.2749 1404.6144 1440.2619 1456.5986 1457.7311 1458.8655 1461.1510 1463.2475 1469.8496 1472.9063 1477.4530 1479.0314 1480.4524 1487.0810 1487.9696 1491.3325 1495.2243 1682.3068 2440.0816 2902.1191 2920.0894 2925.0248 2932.0327 2933.0616 2956.4399 2957.9644 2960.5123 2964.0258 2968.5657 2972.7049 2974.0087 2977.7645 2980.8269 2985.7511 2990.8387 2996.4879 2998.8987 3015.0773 3026.1968 3027.9221 3032.9042 3033.5200 3041.4416 3056.9147 3057.4374 3061.5389 3062.8964 3072.3032 3075.2252 3078.5806 3079.5484 3087.3377 3099.9099 3551.4080
redmass: 5.8766 4.1595 3.3724 5.4570 3.7881 3.7373 3.1129 1.8489 2.3139 2.1151 1.5185 1.4697 2.2927 1.6687 2.2897 2.5023 1.8325 1.2652 2.0775 2.4464 2.3395 2.3192 2.4898 1.3086 2.3326 2.4697 2.5853 2.2512 2.7478 3.5664 3.1639 3.2204 2.2154 2.7547 2.8849 3.6625 2.8837 2.8106 3.1252 3.6700 3.1386 3.3871 3.8097 2.5732 2.8246 2.0518 2.5010 1.3396 1.7652 1.9441 1.8432 1.7333 1.9930 2.0523 2.0314 1.8099 1.8829 1.8817 1.7133 1.5035 1.9040 1.7231 1.8049 2.0968 2.6174 2.2531 2.8551 1.8979 2.1474 2.1457 2.1477 1.8549 2.0466 1.8414 2.3510 2.3764 1.6021 1.9342 1.7976 1.6948 1.5479 2.0339 1.9438 1.5516 1.9761 1.9145 2.0628 1.5659 2.6360 1.8573 1.3909 1.4324 1.6466 1.4868 1.2513 1.3356 1.4182 1.3732 1.3467 1.4785 1.3749 1.3154 1.3218 1.3302 1.3664 1.4852 1.3231 1.4025 1.4080 1.6064 1.3911 1.3710 1.3624 1.3978 1.5729 1.3892 1.6020 1.4838 1.2440 1.2088 1.2339 1.6207 1.0837 1.0863 1.0801 1.0804 1.0762 1.0740 1.0806 1.0765 1.0653 1.0721 1.0704 1.0564 1.0760 1.0560 1.0603 7.7939 1.0384 1.0813 1.0805 1.0673 1.0800 1.0836 1.0755 1.0597 1.0719 1.0621 1.0807 1.0624 1.0379 1.0391 1.0397 1.0574 1.0666 1.0624 1.0887 1.1011 1.0602 1.0970 1.0957 1.0994 1.1003 1.1025 1.1009 1.0985 1.0982 1.0993 1.0976 1.0914 1.0959 1.0975 1.1047 1.0660
irintensity: 0.3196 0.7846 0.0592 0.4369 0.5324 0.4908 0.6482 0.2814 8.2332 0.8979 0.3254 1.6285 7.4707 6.8179 3.7301 0.4858 0.6104 2.5820 1.1560 4.7800 9.9107 0.9278 9.2989 91.6708 17.7389 29.2476 0.0875 0.1569 0.2486 1.8678 0.1673 1.5514 1.0195 1.0784 2.6431 5.8110 2.5613 1.2434 3.0203 4.3189 0.6935 8.7169 4.9366 4.9999 0.9813 1.2598 3.7390 0.5277 4.4608 3.6711 8.7129 3.8551 7.6630 2.8948 3.8328 2.1907 3.6949 2.1573 12.0255 4.8030 4.0138 10.1363 14.7167 11.6853 33.3865 2.4977 54.2897 1.9160 3.3047 32.7411 1.3513 14.7722 1.3841 3.1036 4.5395 12.7319 4.3033 3.3686 1.6027 7.2868 1.7923 3.8481 3.3703 7.5001 11.2812 7.2963 1.3990 1.8663 2.7802 5.5586 8.5936 1.5108 15.1047 9.1663 0.6859 0.5634 4.0617 13.0622 3.3438 2.7705 0.6362 2.1165 3.0739 0.2800 6.7416 0.5021 5.3415 0.6414 1.5129 2.2617 3.4538 7.9710 13.7835 2.7619 6.8666 0.7337 5.4211 4.6903 17.5525 5.4548 38.1621 2.6173 17.9815 9.9702 3.9472 9.0485 1.2420 8.4035 3.5612 5.1069 11.8848 1.2202 32.2630 23.3566 2.3275 2.4329 6.4497 2.9383 23.6088 9.3108 11.6210 35.8083 7.6340 36.0278 8.4511 42.2870 37.1892 19.6586 33.1400 45.4606 33.8828 25.5112 8.5159 42.8202 22.4809 25.3256 63.7650 40.3665 38.3443 13.1393 74.0022 11.4564 48.6266 42.3571 78.1917 44.3016 31.2223 29.6986 58.5412 23.9438 59.0271 32.9388 14.5266 3.1916
temp: 298.150 k
press: 1.00000 atm
elementType: 16 8 6 6 6 6 6 6 6 6 6 6 6 6 6 6 6 6 6 6 6 6 6 6 1 1 1 1 1 1 1 1 1 1 1 1 1 1 1 1 1 1 1 1 1 1 1 1 1 1 1 1 1 1 1 1 1 1 1 1
symmnumber: 1
zpe: 1392417.6 jmol-1
zpe.correction: 0.530344 hartree
zpe.thermalcorrener: 0.555323 hartree
zpe.thermalcorrenthalpy: 0.556267 hartree
zpe.thermalcorrgfe: 0.477363 hartree
zpe.sumelectzpe: -1331.308218 hartree
zpe.sumelectthermal: -1331.283238 hartree
zpe.sumelectthermalent: -1331.282294 hartree
zpe.sumelectthermalfe: -1331.361199 hartree
dipole: -0.9387 0.4193 1.2031
dipole: 1.5825
quadrupole: -173.9799 -152.9168 -158.8129
quadrupole: 16.6601 -11.7694 -0.0744
quadrupole: -12.0767 8.9864 3.0903 16.6601 -11.7694 -0.0744
hfenergy: -1331.8385614 hartree
pointgroup: C01 [X(C22H36O1S1)]
dipole: -0.3899289 -0.1490783 -0.4619206 debye
polarizability: 303.0726782|2.1243454|233.2680475|-6.1616036|-1.8782831|199.4614024 unknown
InChI: InChI=1S/C22H36OS/c1-14(13-24)18-6-7-19-17-5-4-15-12-16(23)8-10-21(15,2)20(17)9-11-22(18,19)3/h4,14,16-20,23-24H,5-13H2,1-3H3
charge 0 multiplicity 1
60 atoms
S  -6.151105 0.180036 2.17859
O  6.763962 0.318892 0.631464
C  -2.049473 0.267564 -0.416352
C  -1.215597 -0.971185 0.05252
C  0.268742 -0.958287 -0.364956
C  0.949936 0.340496 0.168809
C  -3.459438 -0.132762 0.158979
C  -1.376462 1.51345 0.217713
C  2.462143 0.451548 -0.262851
C  -2.086949 -2.187786 -0.337648
C  0.122377 1.611584 -0.173924
C  -3.550899 -1.677653 -0.129596
C  0.999999 -2.204026 0.188684
C  -2.111122 0.394718 -1.962487
C  -4.718008 0.632752 -0.333523
C  3.17527 -0.900241 -0.052975
C  3.161394 1.523598 0.646346
C  2.505425 -2.065387 0.161082
C  2.602868 0.864632 -1.761549
C  4.699798 -0.88292 -0.105385
C  4.700691 1.565513 0.51944
C  5.306163 0.192782 0.825878
C  -6.016218 0.052035 0.281095
C  -4.655476 2.163511 -0.112904
H  -1.219962 -0.920606 1.167531
H  0.342245 -0.979676 -1.472398
H  0.951323 0.242792 1.279934
H  -3.4098 0.008278 1.260575
H  -1.467078 1.442487 1.322426
H  -1.882589 2.449012 -0.085011
H  -1.865557 -3.078917 0.276281
H  -1.910538 -2.470706 -1.393522
H  0.191679 1.821227 -1.258048
H  0.562182 2.489093 0.338203
H  -4.163967 -1.867139 -1.033142
H  -4.045111 -2.203862 0.707106
H  0.698309 -3.104986 -0.382803
H  0.665718 -2.39124 1.234218
H  -2.664954 1.305926 -2.257145
H  -1.108255 0.463557 -2.418105
H  -2.623236 -0.469193 -2.423662
H  -4.820706 0.450138 -1.427314
H  2.894722 1.311015 1.702682
H  2.753862 2.52475 0.410263
H  3.087553 -2.985466 0.324953
H  2.288655 1.912037 -1.921869
H  3.647584 0.780385 -2.107326
H  1.988968 0.214107 -2.410236
H  5.09108 -1.885851 0.15898
H  5.06048 -0.65647 -1.130497
H  5.009266 1.862485 -0.501253
H  5.121441 2.316582 1.213398
H  5.087836 -0.0808 1.883442
H  -6.90603 0.550536 -0.140669
H  -6.105027 -1.03036 0.095004
H  -4.377235 2.404464 0.929622
H  -3.912482 2.638639 -0.775145
H  -5.636375 2.631224 -0.325971
H  7.186373 -0.561866 0.799991
H  -6.376297 1.545436 2.230565
