program: Gaussian 09
title: 000195168
version: EM64L-G09RevD.01
frameworkgroup: C1[X(C20H25N2O2)]
method: RPBEPBE
basis: SDD
operation: Freq
keyword: #p
keyword: freq=noraman
keyword: PBEPBE/SDD
title: #p freq=noraman PBEPBE/SDD
converged: NO YES NO NO
title: Mulliken charges:
elementType: O O N N C C C C C C C C C C C C C C C C C C C C H H H H H H H H H H H H H H H H H H H H H H H H H
charge: -0.347382 -0.264660 -0.086383 -0.336494 -0.362088 -0.374813 -0.499441 -0.481772 -0.018342 -0.562350 -0.545793 0.259379 0.362919 0.376453 -0.346400 -0.372719 -0.344726 -0.346043 -0.230499 -0.231021 -0.218110 -0.220231 -0.239103 -0.241908 0.267357 0.291033 0.303993 0.264910 0.300400 0.247755 0.241952 0.273072 0.313839 0.264681 0.273919 0.265261 0.262722 0.262513 0.276942 0.259768 0.269238 0.301486 0.267133 0.237969 0.246434 0.238541 0.248274 0.243341 0.248994
chargesum: 1.00000
title: Mulliken charges with hydrogens summed into heavy atoms:
elementType: O O N N C C C C C C C C C C C C C C C C C C C C
charge: -0.347382 -0.264660 -0.086383 -0.336494 0.196301 0.194089 0.048713 0.033251 0.295498 0.241512 0.256384 0.259379 0.362919 0.376453 -0.086632 -0.103481 -0.043240 -0.078910 0.007471 0.015412 0.020431 0.028042 0.004238 0.007086
polarizability: 2.71836297e+02 1.55181876e+01 2.39634812e+02 1.04939054e+01 2.83734731e+00 1.67849001e+02
1716.lowfreq: -16.6553 -4.7588 -4.1393 0.0002 0.0004 0.0006 9.4362 15.8230 23.8631
frequency: 6.3602 12.1015 22.5734 45.8133 55.1025 65.0955 75.7304 96.8547 112.2561 146.8757 163.4383 204.6797 220.2440 235.7161 245.8684 267.5270 291.9837 301.6389 313.2160 353.5009 372.6107 395.0376 404.7013 408.9847 416.1353 419.9711 430.6359 435.5877 492.7565 502.7932 520.0905 523.7928 611.0244 613.1896 615.5564 653.0870 666.5864 676.4853 689.1778 694.1084 702.2960 740.3862 764.8295 766.6327 781.8327 834.2613 844.3444 852.5030 855.7317 866.0114 889.6160 923.7108 924.8799 938.5381 953.8463 963.1476 968.3544 979.9350 982.3677 985.7742 986.1441 988.7122 1002.7524 1004.0081 1010.5287 1023.0914 1034.7878 1047.5794 1075.1112 1077.7064 1082.1055 1098.4209 1125.1486 1144.4479 1148.7367 1161.0946 1174.6888 1179.1899 1180.0008 1188.3910 1204.5700 1205.0816 1250.3400 1250.7739 1269.8988 1275.0431 1305.1085 1308.4000 1327.3775 1334.8371 1337.7886 1348.8188 1363.2383 1365.4757 1374.8192 1381.7072 1382.3174 1421.6234 1436.4678 1441.6718 1446.8854 1450.0750 1452.0880 1452.8873 1469.3075 1472.9246 1478.1209 1480.6265 1481.2782 1488.7451 1493.3743 1591.3256 1593.7008 1600.5635 1609.2333 1653.5119 3015.9252 3018.4874 3019.8157 3028.2942 3030.1886 3034.7446 3066.0056 3076.3156 3081.3754 3104.5012 3109.6875 3132.6205 3135.2069 3138.9420 3139.7359 3139.8221 3141.1909 3148.9506 3151.0801 3158.0841 3159.5960 3166.9443 3173.3666 3178.2256 3206.6421
redmass: 3.8980 4.1720 4.2412 3.7823 3.8151 5.1043 5.3361 6.1284 4.5031 2.5889 1.3623 2.7840 2.9057 2.4140 1.6230 3.4064 4.3970 2.2906 4.0236 2.6146 4.5044 3.0524 2.8971 2.8887 2.3744 2.1277 4.7184 2.4198 3.7595 3.4544 3.8712 3.7449 5.3515 6.4860 5.7114 5.1941 4.7764 7.6238 3.2605 2.1808 2.0260 3.7492 1.6660 1.5872 2.0728 3.5128 1.2557 2.6465 1.2571 2.5527 3.2431 1.6829 1.4132 3.1651 2.9616 2.2885 5.4504 1.4116 1.4369 1.8766 3.2515 4.5575 1.3157 1.3732 2.0108 2.0417 2.2258 2.0467 1.5430 1.7938 1.2832 1.5985 1.2520 3.2276 1.7928 1.8779 1.0656 1.1228 1.0570 1.1527 1.2737 1.4389 1.3149 3.8476 2.0977 2.1562 1.5273 1.4680 1.5066 1.4087 1.4616 1.3715 1.4461 1.3556 9.0432 6.5582 1.3837 1.1517 2.1601 1.1370 2.3341 1.0747 1.0767 1.0732 1.0616 1.0677 2.3640 1.0580 2.1386 1.0997 1.0571 6.3591 6.5087 6.2060 6.0030 11.1743 1.0628 1.0363 1.0591 1.0392 1.0562 1.0576 1.0875 1.0996 1.1005 1.1079 1.1086 1.0865 1.1055 1.1051 1.1049 1.0859 1.0883 1.0906 1.0933 1.1035 1.0967 1.0946 1.1016 1.0987 1.0940
irintensity: 0.7346 1.2292 3.2012 1.8171 0.3629 1.5496 1.4035 0.3882 0.9793 1.3312 1.2925 3.9534 1.5723 6.7872 1.0050 2.4118 9.5240 1.7061 2.5533 0.4337 7.4414 1.7629 0.2599 0.0432 0.7553 0.0324 1.4558 0.5270 0.3270 1.8652 8.9642 10.9973 28.3459 0.6737 9.9990 5.5999 2.8257 6.5362 13.2364 24.7554 51.3650 3.6922 4.0082 80.9871 46.9702 1.8925 1.2142 2.2492 0.1832 4.6644 65.9283 3.4647 3.8803 2.2437 22.7901 24.5064 296.1651 0.5205 1.4305 2.6138 9.5171 2.1733 0.6904 2.0111 43.5928 16.6264 2.3621 45.5941 10.7924 10.9120 0.2822 14.7411 2.7527 170.9931 7.1888 6.1152 0.4230 3.2205 0.5445 5.0108 9.9068 0.2491 62.2672 19.9169 150.8469 258.5464 9.4742 15.7050 49.1051 8.7109 13.0831 9.9679 8.2477 0.4749 1.5539 0.4548 4.0104 10.8286 6.4168 2.8687 23.8330 15.0009 19.8631 1.0665 26.2138 41.1865 66.8813 49.9143 74.4930 19.5076 31.9382 4.4352 2.3590 36.5343 39.0368 342.1386 6.7973 3.1732 15.3964 4.8827 8.8205 18.4692 12.3852 4.5257 8.8739 2.7098 7.4245 2.2281 0.1511 3.2580 6.5319 0.7705 0.5010 9.8903 11.1674 3.9880 12.0952 20.7668 8.2187 7.0760 5.5057
temp: 298.150 k
press: 1.00000 atm
elementType: 8 8 7 7 6 6 6 6 6 6 6 6 6 6 6 6 6 6 6 6 6 6 6 6 1 1 1 1 1 1 1 1 1 1 1 1 1 1 1 1 1 1 1 1 1 1 1 1 1
symmnumber: 1
zpe: 1086127.2 jmol-1
zpe.correction: 0.413684 hartree
zpe.thermalcorrener: 0.435797 hartree
zpe.thermalcorrenthalpy: 0.436741 hartree
zpe.thermalcorrgfe: 0.358882 hartree
zpe.sumelectzpe: -1035.082801 hartree
zpe.sumelectthermal: -1035.060688 hartree
zpe.sumelectthermalent: -1035.059744 hartree
zpe.sumelectthermalfe: -1035.137603 hartree
dipole: 15.4371 1.8757 -2.0712
dipole: 15.6879
quadrupole: -50.9806 -122.2213 -127.0579
quadrupole: -5.3873 -5.6844 2.0982
quadrupole: 49.1060 -22.1347 -26.9713 -5.3873 -5.6844 2.0982
hfenergy: -1035.496485 hartree
pointgroup: C01 [X(C20H25N2O2)]
dipole: 5.8488331 -1.2551368 1.5201115 debye
polarizability: 267.2630991|-20.4173163|240.4662672|0.7106856|-18.4303984|171.590744 unknown
InChI: InChI=1S/C20H25N2O2/c1-22(2)15-13-19(14-16-22)24-20(23)21(17-9-5-3-6-10-17)18-11-7-4-8-12-18/h3-12,19H,13-16H2,1-2H3
charge 1 multiplicity 1
49 atoms
O  1.010527 0.507127 -0.707331
O  -0.174852 2.483144 -1.134209
N  4.013118 -0.085531 0.951654
N  -1.261604 0.521984 -0.319448
C  3.029494 1.058535 1.31961
C  3.510928 -0.818092 -0.321538
C  2.758666 2.013884 0.14985
C  3.239154 0.138577 -1.492255
C  2.247412 1.238568 -1.082497
C  5.420512 0.461029 0.741581
C  4.041716 -1.086697 2.103049
C  -0.192442 1.287037 -0.753285
C  -2.633046 1.015842 -0.26251
C  -1.00046 -0.847104 0.124271
C  -3.667564 0.086399 0.027063
C  -0.852023 -1.108458 1.505401
C  -2.958584 2.38181 -0.477613
C  -0.926699 -1.894689 -0.819399
C  -5.007287 0.519864 0.103577
C  -0.607544 -2.430901 1.943505
C  -4.305717 2.79608 -0.397326
C  -0.679664 -3.214596 -0.377631
C  -5.337571 1.876942 -0.105972
C  -0.516032 -3.484708 1.002292
H  3.461519 1.576829 2.192492
H  2.092487 0.558466 1.618149
H  2.571943 -1.320511 -0.035002
H  4.272942 -1.57622 -0.569992
H  1.988311 2.737199 0.470557
H  3.651708 2.607716 -0.118884
H  4.166024 0.594758 -1.884592
H  2.806527 -0.461642 -2.311511
H  2.023761 1.932391 -1.910165
H  6.094319 -0.373268 0.49264
H  5.422513 1.192545 -0.076969
H  5.756345 0.947171 1.670574
H  4.73906 -1.902613 1.856775
H  4.375133 -0.574987 3.01942
H  3.029076 -1.493478 2.248199
H  -3.439469 -0.969936 0.189435
H  -0.961831 -0.289224 2.224775
H  -2.179356 3.104971 -0.717673
H  -1.07019 -1.675823 -1.882525
H  -5.792462 -0.210658 0.325032
H  -0.517829 -2.64226 3.01473
H  -4.544131 3.851506 -0.567134
H  -0.633215 -4.031447 -1.105532
H  -6.378444 2.210205 -0.046742
H  -0.344584 -4.511435 1.342805
