program: Gaussian 09
title: 000195147
version: EM64L-G09RevD.01
frameworkgroup: C1[X(C17H12O6)]
method: RPBEPBE
basis: SDD
operation: Freq
keyword: #pfreq=noraman
keyword: PBEPBE/SDD
title: #p freq=noraman PBEPBE/SDD
converged: NO YES NO NO
title: Mulliken charges:
elementType: O O O O O O C C C C C C C C C C C C C C C C C H H H H H H H H H H H H
charge: -0.391702 -0.179659 -0.324510 -0.384792 -0.239523 -0.323138 0.201576 -0.004555 0.347205 0.273894 -0.181400 -0.044657 0.039820 0.035358 0.344730 -0.432744 -0.377270 -0.392559 0.102605 -0.347998 -0.779906 0.215238 -0.498735 0.283617 0.296644 0.245029 0.271024 0.250296 0.216395 0.248941 0.391853 0.395718 0.250302 0.255029 0.237873
chargesum: 0.00000
title: Mulliken charges with hydrogens summed into heavy atoms:
elementType: O O O O O O C C C C C C C C C C C C C C C C C
charge: 0.000152 -0.179659 -0.324510 0.010926 -0.239523 -0.323138 0.201576 -0.004555 0.347205 0.273894 -0.181400 -0.044657 0.039820 0.035358 0.344730 -0.149126 -0.080626 -0.147530 0.102605 -0.076973 -0.064274 0.215238 0.244469
polarizability: 3.61988957e+02 1.48896236e+01 2.45471588e+02 -1.29659646e+01 8.14556265e+00 9.55590738e+01
1716.lowfreq: -8.6063 -5.8192 0.0004 0.0006 0.0008 3.6049 35.1145 48.7394 52.8868
frequency: 35.1112 48.7261 52.8822 77.8244 90.2459 97.1693 110.4220 123.1058 149.9035 153.7828 188.9682 205.7220 235.1240 260.7331 280.9748 294.9468 305.6740 317.6145 327.9925 341.9274 387.0655 402.8105 417.6316 446.3195 461.5648 467.4336 483.9878 523.1528 531.0206 540.9220 590.3381 592.6983 656.1091 663.8860 702.2505 711.4552 724.7050 747.4236 763.1379 779.5311 790.3895 814.6951 846.4714 858.1872 865.6551 870.3494 915.2948 955.6747 968.5955 975.8708 991.7713 1003.7325 1046.3298 1049.3634 1067.3504 1104.2167 1117.2092 1152.5809 1156.9105 1184.9956 1204.3965 1230.0317 1263.5402 1279.1569 1296.4246 1304.5915 1351.3925 1365.3264 1390.9760 1401.3190 1404.3810 1412.9828 1424.1739 1441.7898 1449.5978 1450.0774 1452.6265 1457.6548 1463.9011 1470.7220 1531.1026 1541.3894 1556.8377 1580.7667 1593.5955 1606.0215 1627.3128 2696.9586 2986.2218 3011.7644 3029.5909 3062.5984 3100.7623 3119.4845 3136.4297 3159.3113 3162.2031 3170.2095 3184.2115
redmass: 5.0407 1.7335 2.7764 5.3086 2.3325 1.3368 2.7718 6.2838 5.9751 7.3561 6.0387 5.6420 5.8496 5.2265 4.9753 4.5805 5.5932 5.6426 7.0750 6.4769 6.6544 10.1727 9.6545 7.3956 6.7676 4.5337 5.6301 6.3596 5.0447 5.9025 5.2973 5.5033 7.4596 6.2914 6.5753 6.3292 5.4297 6.7166 6.1491 6.7328 7.0322 3.4022 1.2500 6.4062 1.6326 1.4967 7.9814 2.2175 1.1297 1.3292 3.3230 1.3886 1.5505 3.7812 2.5645 1.9658 1.5459 1.5031 1.5288 1.6633 2.4603 3.0487 2.0097 3.6398 3.8554 3.7821 2.9262 4.3917 2.9498 1.3291 3.2068 3.5744 2.1203 2.8894 1.0551 3.4899 1.0915 3.2630 1.0981 1.1691 5.1474 8.9483 5.0008 4.0017 5.9390 4.3275 6.0038 1.0718 1.0369 1.0291 1.0678 1.0960 1.1006 1.1052 1.0900 1.1053 1.0891 1.0946 1.0972
irintensity: 0.6944 0.4342 0.7633 3.5345 0.3189 0.3290 6.4880 0.8058 1.2788 0.1549 0.1453 1.5645 1.6207 4.5131 2.1218 0.8548 4.9092 3.0140 3.4571 20.3690 12.6894 15.0023 1.8665 4.6740 2.4994 2.0766 3.0869 1.1443 10.8698 11.7912 9.5378 14.4797 8.6923 3.2777 16.0197 1.0843 16.7616 15.2815 6.4586 0.8847 28.3417 2.3524 209.1103 4.8422 14.0960 8.3980 9.9147 8.1497 97.6512 26.8434 15.4980 1.1163 10.8030 43.7722 11.9509 87.5889 20.2115 7.3057 32.2814 13.9653 153.9068 150.2879 52.5636 46.9958 809.9335 7.8462 30.5025 379.1992 91.0068 131.9607 39.9766 35.5825 185.9943 141.2024 13.1113 43.0390 18.2352 17.3760 13.7723 18.2710 13.7558 202.1199 62.7335 44.9353 32.9553 110.6300 105.1804 194.8003 17.8996 42.9489 337.7639 10.3791 20.2393 15.7774 18.1992 9.7505 0.6463 3.9202 3.7065
temp: 298.150 k
press: 1.00000 atm
elementType: 8 8 8 8 8 8 6 6 6 6 6 6 6 6 6 6 6 6 6 6 6 6 6 1 1 1 1 1 1 1 1 1 1 1 1
symmnumber: 1
zpe: 660337.3 jmol-1
zpe.correction: 0.251509 hartree
zpe.thermalcorrener: 0.271148 hartree
zpe.thermalcorrenthalpy: 0.272092 hartree
zpe.thermalcorrgfe: 0.203183 hartree
zpe.sumelectzpe: -1104.788838 hartree
zpe.sumelectthermal: -1104.769199 hartree
zpe.sumelectthermalent: -1104.768255 hartree
zpe.sumelectthermalfe: -1104.837164 hartree
dipole: -0.8606 -2.6706 1.4649
dipole: 3.1653
quadrupole: -129.5414 -120.9947 -134.4167
quadrupole: 5.0798 6.3563 -5.7932
quadrupole: -1.2238 7.3229 -6.0991 5.0798 6.3563 -5.7932
hfenergy: -1105.0403467 hartree
pointgroup: C01 [X(C17H12O6)]
dipole: -0.321149 1.0274259 -0.6261608 debye
polarizability: 361.3224744|-15.3852014|246.169719|17.0425705|1.2081763|95.5274255 unknown
InChI: InChI=1S/C17H12O6/c1-7-3-4-9-12(14(7)19)16(21)8-5-6-10(18)13(17(22)23-2)11(8)15(9)20/h3-6,18-19H,1-2H3
charge 0 multiplicity 1
35 atoms
O  -4.02528 -1.48038 -0.354019
O  0.806137 1.95649 1.006998
O  -1.814459 -2.689771 -0.180278
O  4.486621 -1.664538 0.332679
O  2.742693 1.830599 -0.890002
O  4.49575 0.920681 0.325895
C  1.003534 -0.309901 0.169911
C  -1.915864 -0.300022 0.007667
C  -1.235662 0.93602 0.239697
C  0.292427 -1.541397 0.082034
C  0.236233 0.953795 0.474807
C  -1.18013 -1.563859 -0.023319
C  2.428069 -0.323397 0.134359
C  -3.338175 -0.306795 -0.163562
C  -4.085638 0.914626 -0.133157
C  -1.971536 2.133999 0.288917
C  1.003361 -2.776388 0.057291
C  -3.376716 2.112219 0.093123
C  3.121541 -1.581062 0.217166
C  2.394132 -2.802624 0.160171
C  -5.581055 0.869678 -0.329902
C  3.285322 0.871402 -0.076996
C  3.530064 3.0766 -1.067181
H  -1.441317 3.0708 0.482309
H  0.421665 -3.700213 -0.014369
H  -3.937631 3.053361 0.121663
H  2.957347 -3.738774 0.193814
H  -6.058521 0.232803 0.437515
H  -6.023925 1.878032 -0.282289
H  -5.83591 0.41077 -1.302843
H  -3.324545 -2.250276 -0.330223
H  4.862036 -0.723949 0.459905
H  4.573153 2.83822 -1.331071
H  3.501358 3.6538 -0.12842
H  3.019521 3.61445 -1.877092
