program: Gaussian 09
title: 000195134
version: EM64L-G09RevD.01
frameworkgroup: C1[X(C15H12N2O2)]
method: RPBEPBE
basis: SDD
operation: Freq
keyword: #p
keyword: freq=noraman
keyword: PBEPBE/SDD
title: #p freq=noraman PBEPBE/SDD
converged: NO YES NO NO
title: Mulliken charges:
elementType: O O N N C C C C C C C C C C C C C C C H H H H H H H H H H H H
charge: -0.175705 -0.148382 -0.394972 0.055225 0.229663 0.372424 0.372320 0.242988 0.052894 0.129075 -0.184712 -0.422755 -0.423293 -0.827526 -0.828978 -0.275588 -0.223453 -0.143601 -0.341833 0.235856 0.235573 0.228718 0.272144 0.230052 0.229327 0.267791 0.232739 0.278238 0.227758 0.241167 0.256847
chargesum: 0.00000
title: Mulliken charges with hydrogens summed into heavy atoms:
elementType: O O N N C C C C C C C C C C C C C C C
charge: -0.175705 -0.148382 -0.394972 0.055225 0.229663 0.372424 0.372320 0.242988 0.052894 0.129075 -0.184712 -0.186899 -0.187720 -0.096611 -0.099121 0.002650 0.004305 0.097566 -0.084986
polarizability: 2.54568359e+02 1.20291019e+00 1.59540152e+02 1.02386640e+00 7.07549430e+00 1.20868600e+02
1716.lowfreq: -5.1368 -3.1176 0.0006 0.0008 0.0009 2.1677 36.5090 44.2052 65.1380
frequency: 36.4984 44.1982 65.1355 123.9251 126.8853 135.9537 141.0601 155.9773 186.4977 209.6941 224.6104 252.8051 305.5750 318.2458 349.2232 350.2953 412.5073 432.9031 483.0103 519.8557 520.4673 523.3289 532.9612 547.8256 568.9967 655.4800 673.2864 701.9662 722.7342 724.7886 749.8183 782.3173 808.0100 830.6909 831.9577 876.2133 900.5232 920.5945 956.0629 982.4268 988.2341 999.1578 1019.0578 1038.1357 1044.9509 1049.6464 1056.4120 1077.3497 1083.8537 1123.9041 1161.0818 1180.4737 1220.3209 1263.0133 1268.6027 1275.4349 1323.7889 1350.6979 1370.8384 1396.2305 1397.4597 1402.0407 1442.0320 1444.8786 1457.0664 1469.2866 1469.5558 1485.9066 1488.8879 1568.6306 1595.5107 1604.0390 1604.9229 1635.8345 1687.8117 2981.4187 2982.2106 3061.7287 3062.3722 3092.2583 3092.6344 3126.6410 3138.3719 3145.2207 3159.9394 3160.1554 3178.9837
redmass: 4.8047 5.2453 4.8354 1.8902 4.4330 4.1412 1.1618 1.6196 6.1234 4.7217 2.7989 7.5969 4.0958 4.0989 4.3676 5.7240 4.2376 4.2763 3.7714 5.3980 3.1895 5.6331 6.1799 5.1128 8.5150 8.1917 5.1710 5.3944 6.0409 4.9467 4.8911 1.2193 3.3224 2.1499 4.9475 7.8461 1.3085 2.6048 1.4040 1.3449 1.5983 1.4021 3.2268 2.0286 1.7172 1.5332 2.6200 4.8715 2.6499 2.2785 1.5517 1.1655 3.8501 1.5735 3.7056 2.0700 4.8319 6.9059 7.5599 1.2393 1.2381 2.5344 2.1339 2.4333 1.9036 1.0772 1.0521 1.2413 1.2832 7.8146 7.3923 5.8459 7.7818 12.3564 12.6274 1.0372 1.0372 1.0976 1.0976 1.0988 1.0987 1.0857 1.0920 1.0891 1.0996 1.0924 1.1000
irintensity: 0.3957 2.2296 1.1528 4.9152 0.9973 4.3913 0.2279 1.8779 0.1966 1.9401 0.1975 1.9383 5.2621 1.6251 1.1714 5.9716 1.1881 0.1557 0.0624 3.8785 0.7233 1.6119 8.9167 1.8933 3.1814 11.9780 4.7677 12.2487 11.1449 29.0732 3.8210 54.0634 11.5139 18.4505 20.5404 14.0180 0.0124 4.5726 0.0589 0.3929 4.8173 0.4621 3.1734 29.5364 45.5875 0.5400 23.3404 28.5651 0.1532 25.3007 8.0342 2.2447 6.1417 0.2935 27.1354 3.1409 248.1370 26.8941 4.8580 24.3655 1.6419 20.6319 4.7662 12.0359 1.2868 43.3908 2.0196 34.2210 53.2602 28.6200 12.4969 4.8322 12.6751 362.0433 18.9756 29.2051 12.3053 8.9228 12.2910 19.4463 30.2923 0.1205 21.7147 6.3103 35.5929 4.3883 18.0604
temp: 298.150 k
press: 1.00000 atm
elementType: 8 8 7 7 6 6 6 6 6 6 6 6 6 6 6 6 6 6 6 1 1 1 1 1 1 1 1 1 1 1 1
symmnumber: 1
zpe: 615552.2 jmol-1
zpe.correction: 0.234451 hartree
zpe.thermalcorrener: 0.250532 hartree
zpe.thermalcorrenthalpy: 0.251477 hartree
zpe.thermalcorrgfe: 0.190618 hartree
zpe.sumelectzpe: -837.453333 hartree
zpe.sumelectthermal: -837.437252 hartree
zpe.sumelectthermalent: -837.436308 hartree
zpe.sumelectthermalfe: -837.497166 hartree
dipole: 2.1183 1.7950 1.5116
dipole: 3.1614
quadrupole: -80.3704 -113.2129 -116.4254
quadrupole: 6.6278 5.4964 -12.9019
quadrupole: 22.9659 -9.8766 -13.0892 6.6278 5.4964 -12.9019
hfenergy: -837.6877841 hartree
pointgroup: C01 [X(C15H12N2O2)]
dipole: 0.8301183 0.7488039 0.5451603 debye
polarizability: 254.5536282|1.8136522|160.3233822|0.6801142|4.4592327|120.100102 unknown
InChI: InChI=1S/C15H12N2O2/c1-9-5-3-6-10(2)13(9)17-14(18)11-7-4-8-16-12(11)15(17)19/h3-8H,1-2H3
charge 0 multiplicity 1
31 atoms
O  0.199234 1.925391 1.386348
O  0.204428 -1.895519 -1.393029
N  -0.166474 0.010698 -0.000205
N  3.184866 -1.161618 -0.876591
C  -1.614561 0.002232 0.00001
C  -2.293118 -1.029028 0.706728
C  -2.306059 1.022331 -0.710433
C  2.052808 0.600182 0.411373
C  0.632338 0.972443 0.696142
C  0.642275 -0.950382 -0.706213
C  2.069944 -0.544392 -0.419835
C  -3.708657 -1.020576 0.689256
C  -3.721261 0.993867 -0.697026
C  -1.537371 -2.108679 1.457117
C  -1.562999 2.110195 -1.461651
C  3.262112 1.180619 0.825015
C  -4.418795 -0.018401 -0.004734
C  4.448365 0.556461 0.362853
C  4.364904 -0.589478 -0.469854
H  -4.251969 -1.805257 1.227583
H  -4.274333 1.769575 -1.238422
H  -2.220139 -2.690668 2.09803
H  -1.050687 -2.810486 0.754832
H  -0.745956 -1.682574 2.100665
H  -2.253094 2.685838 -2.100462
H  -1.081559 2.816145 -0.759762
H  -0.769797 1.691711 -2.107978
H  3.279326 2.065175 1.468718
H  -5.514299 -0.026632 -0.006673
H  5.431867 0.947121 0.640306
H  5.275362 -1.078891 -0.832209
