program: Gaussian 09
title: 000195111
version: EM64L-G09RevD.01
frameworkgroup: C1[X(C9H14N4O)]
method: RPBEPBE
basis: SDD
operation: Freq
keyword: #p
keyword: freq=noraman
keyword: PBEPBE/SDD
title: #p freq=noraman PBEPBE/SDD
converged: NO YES NO NO
title: Mulliken charges:
elementType: O N N N N C C C C C C C C C H H H H H H H H H H H H H H
charge: -0.211581 0.006009 -0.166758 -0.073355 -0.608368 -0.153551 -0.124159 -0.476128 -0.473981 -0.512108 -0.439212 -0.447662 0.159562 0.053422 0.240091 0.248366 0.215294 0.219359 0.247927 0.207099 0.260734 0.234178 0.230420 0.226826 0.225140 0.240256 0.337819 0.334363
chargesum: 0.00000
title: Mulliken charges with hydrogens summed into heavy atoms:
elementType: O N N N N C C C C C C C C C
charge: -0.211581 0.006009 -0.166758 -0.073355 0.063814 0.086540 0.124207 -0.041475 -0.018956 -0.017196 0.018034 0.017734 0.159562 0.053422
polarizability: 1.62238056e+02 6.49540009e+00 1.13497293e+02 2.10186511e+00 7.39230134e-01 9.07515088e+01
1716.lowfreq: -6.8094 -0.0008 -0.0006 0.0007 3.3679 11.1513 26.9851 44.1118 84.5043
frequency: 23.3697 43.8052 84.3415 138.0424 227.2263 250.3167 262.3209 302.7765 346.1373 380.1997 384.5459 407.4423 417.7203 429.8924 537.6439 562.2272 591.4135 635.4451 676.8887 717.9761 735.1386 763.3579 798.4668 806.9664 810.0409 821.3902 875.5233 877.9630 917.8541 937.4135 943.4645 970.7448 988.1884 1006.3420 1016.5585 1028.3866 1044.4176 1070.0739 1101.8892 1120.6096 1132.1762 1160.8668 1193.1959 1219.9744 1230.9610 1254.9600 1297.2777 1306.3803 1312.0588 1315.8238 1320.7805 1321.7212 1331.5386 1344.0995 1347.7376 1368.4891 1456.9946 1460.5935 1468.6145 1470.1950 1480.9284 1535.3371 1549.8272 1620.6503 2983.6656 2993.2851 3001.2650 3005.5270 3007.1943 3014.1475 3038.0345 3040.7976 3050.6995 3066.8334 3076.1520 3081.7211 3579.7458 3729.0841
redmass: 6.1359 2.9231 4.3284 2.6079 3.3926 3.2398 3.3674 2.7683 3.0246 2.2129 1.2210 2.2599 2.5622 1.3826 4.1900 3.7389 8.1757 6.6167 5.3500 5.8280 5.1565 4.3553 1.3482 8.3086 2.7592 1.6931 3.1851 3.2114 6.2603 1.9116 4.1431 2.4561 2.6396 3.5467 3.6002 2.0831 3.0416 2.7190 1.7011 2.2370 1.7582 1.3446 1.3155 1.3029 1.1569 1.3837 1.3096 1.3196 1.3253 1.3881 1.4108 1.4733 1.3082 1.5503 2.0418 1.8617 1.0807 1.0805 1.0863 1.0832 1.0979 7.6956 2.5383 1.6889 1.0593 1.0602 1.0608 1.0664 1.0657 1.0738 1.1030 1.0880 1.1033 1.1059 1.1057 1.1060 1.0446 1.1056
irintensity: 2.8180 0.3327 1.0172 0.8199 5.9392 3.5645 2.3315 0.6601 12.6099 2.9782 184.4846 20.4425 32.9537 85.2160 0.7803 2.9427 8.8969 3.9075 2.8771 3.6942 17.1170 23.9739 0.9551 8.2821 11.7276 9.4013 1.7720 4.0482 6.0560 3.1219 19.2553 15.6074 12.9912 0.3758 26.9284 1.1278 18.9602 4.8898 2.9076 24.5031 6.9828 8.0285 18.6628 2.9325 6.6095 12.2332 3.6737 6.1548 13.3841 3.5287 4.4843 0.9976 0.9432 2.5783 35.3522 53.7009 10.8047 4.7848 16.4427 15.6778 4.8242 101.0584 129.0407 344.9417 29.8045 22.6815 85.9166 38.5288 58.9008 28.2130 8.3336 25.3871 0.7140 29.1130 66.3191 26.8433 97.9103 54.8996
temp: 298.150 k
press: 1.00000 atm
elementType: 8 7 7 7 7 6 6 6 6 6 6 6 6 6 1 1 1 1 1 1 1 1 1 1 1 1 1 1
symmnumber: 1
zpe: 611434.4 jmol-1
zpe.correction: 0.232883 hartree
zpe.thermalcorrener: 0.244872 hartree
zpe.thermalcorrenthalpy: 0.245816 hartree
zpe.thermalcorrgfe: 0.193707 hartree
zpe.sumelectzpe: -644.463851 hartree
zpe.sumelectthermal: -644.451863 hartree
zpe.sumelectthermalent: -644.450918 hartree
zpe.sumelectthermalfe: -644.503027 hartree
dipole: -0.5170 1.8278 0.9328
dipole: 2.1162
quadrupole: -74.5580 -84.5393 -84.3349
quadrupole: 17.0834 -3.2818 3.5124
quadrupole: 6.5861 -3.3952 -3.1909 17.0834 -3.2818 3.5124
hfenergy: -644.6967342 hartree
pointgroup: C01 [X(C9H14N4O1)]
dipole: -0.2301709 -0.6627255 -0.4483029 debye
polarizability: 161.6892536|-7.9537205|113.5198497|-3.1279145|3.5409897|91.2777542 unknown
InChI: InChI=1S/C9H14N4O/c10-9-11-8(14-12-9)7-5-13-3-1-6(7)2-4-13/h6-7H,1-5,10H2
charge 0 multiplicity 1
28 atoms
O  1.911279 1.492076 0.220558
N  -2.410617 -0.845131 0.798131
N  1.642113 -0.76333 0.097107
N  3.270987 0.925252 -0.008456
N  3.954923 -1.373042 -0.266694
C  -1.236907 0.768571 -0.868899
C  -0.422911 0.702722 0.476822
C  -2.656267 1.29882 -0.524438
C  -1.356133 -0.645674 -1.495851
C  -1.134985 -0.376699 1.396176
C  -3.303973 0.321921 0.526037
C  -2.125434 -1.567482 -0.480427
C  1.023787 0.406052 0.263915
C  2.998462 -0.410401 -0.066119
H  -0.731929 1.458968 -1.567427
H  -0.478145 1.704838 0.943341
H  -3.260226 1.342079 -1.450337
H  -2.592592 2.329671 -0.126926
H  -0.353037 -1.052966 -1.7140
H  -1.900811 -0.570742 -2.455682
H  -0.475488 -1.251257 1.527946
H  -1.347147 0.054476 2.390453
H  -3.490672 0.834962 1.487031
H  -4.272422 -0.067759 0.16462
H  -3.091706 -1.906347 -0.896016
H  -1.532103 -2.465947 -0.235567
H  3.672324 -2.347754 -0.285411
H  4.93053 -1.114874 -0.376888
