program: Gaussian 09
title: 000195110
version: EM64L-G09RevD.01
frameworkgroup: C1[X(C6H11FO5)]
method: RPBEPBE
basis: SDD
operation: Freq
keyword: #p
keyword: freq=noraman
keyword: PBEPBE/SDD
title: #p freq=noraman PBEPBE/SDD
converged: NO YES NO NO
title: Mulliken charges:
elementType: F O O O O O C C C C C C H H H H H H H H H H H
charge: -0.224580 -0.474972 -0.470844 -0.474027 -0.467059 -0.442784 -0.128747 -0.127459 -0.133547 -0.158356 -0.116231 -0.069753 0.233503 0.238755 0.238337 0.242970 0.238525 0.248059 0.371586 0.371157 0.372140 0.368055 0.365272
chargesum: 0.00000
title: Mulliken charges with hydrogens summed into heavy atoms:
elementType: F O O O O O C C C C C C
charge: -0.224580 -0.103386 -0.099687 -0.101887 -0.099004 -0.077512 0.104756 0.111295 0.104791 0.084614 0.122294 0.178306
polarizability: 9.00859601e+01 7.24421928e-01 8.70985259e+01 -2.44057909e-01 -1.54058005e-01 6.02291757e+01
1716.lowfreq: -11.7430 0.0006 0.0008 0.0011 2.7794 5.2841 74.4015 78.3217 118.3165
frequency: 74.3896 78.2672 118.3109 200.3895 206.4552 213.8028 231.4731 256.3490 266.9472 357.5152 365.5602 386.9051 395.7149 400.2348 421.8017 432.1619 434.9042 439.6970 441.2381 547.4751 575.6065 588.3449 589.9645 911.2983 948.0028 951.5656 962.6325 1028.3807 1041.2744 1051.0579 1060.3910 1066.0163 1070.7256 1076.0148 1101.1280 1146.6953 1204.5908 1207.8886 1213.1095 1226.1496 1252.2185 1289.1314 1300.2575 1303.2694 1311.5543 1315.8999 1333.5727 1369.2508 1385.2955 1388.0200 1397.9883 1403.6543 2961.5872 2963.9572 2970.7695 2975.3024 2992.1731 3058.2115 3542.8563 3561.3821 3562.2404 3562.9605 3575.3878
redmass: 7.0692 7.6991 8.2002 4.2332 4.0166 4.1203 5.2382 4.6022 5.2394 7.9751 6.9062 1.6331 2.2529 1.5888 1.4402 1.3950 2.2948 1.4413 1.3390 6.4859 2.9389 3.0308 3.0497 6.9000 5.2630 6.1672 7.1131 2.5380 3.2581 2.8982 3.5116 2.9030 2.5305 4.0001 2.5345 1.3845 1.1336 1.2432 1.2236 1.1509 1.2150 1.2199 1.2158 1.2117 1.2557 1.3825 1.4471 1.5120 1.6551 1.5872 1.4772 1.4877 1.0816 1.0817 1.0831 1.0846 1.0856 1.0862 1.0655 1.0658 1.0657 1.0656 1.0661
irintensity: 3.6977 3.0031 0.5051 5.6369 0.1501 0.4666 11.3736 48.6972 19.4333 2.1894 4.0093 18.2579 31.7321 64.9971 90.3399 87.6158 32.2397 212.6169 262.6039 10.2866 21.7970 52.7382 61.1811 83.4108 114.8992 75.2097 20.2239 75.2598 11.6801 46.4643 56.0909 45.1132 81.6488 15.4615 4.3427 1.1615 36.6560 30.9966 18.4098 1.6641 11.3770 2.0644 31.8278 82.3380 40.8109 11.9472 4.0011 1.4555 2.3138 12.5586 10.9266 3.3270 6.7378 3.3969 1.0267 1.1557 137.5005 25.4040 20.7109 9.5212 27.0381 35.6336 20.5258
temp: 298.150 k
press: 1.00000 atm
elementType: 9 8 8 8 8 8 6 6 6 6 6 6 1 1 1 1 1 1 1 1 1 1 1
symmnumber: 1
zpe: 466946.6 jmol-1
zpe.correction: 0.177851 hartree
zpe.thermalcorrener: 0.190396 hartree
zpe.thermalcorrenthalpy: 0.191340 hartree
zpe.thermalcorrgfe: 0.140092 hartree
zpe.sumelectzpe: -710.196058 hartree
zpe.sumelectthermal: -710.183512 hartree
zpe.sumelectthermalent: -710.182568 hartree
zpe.sumelectthermalfe: -710.233817 hartree
dipole: -1.1927 2.0588 -0.2079
dipole: 2.3884
quadrupole: -65.9781 -79.2185 -70.3752
quadrupole: 2.6932 0.6545 0.5888
quadrupole: 5.8791 -7.3612 1.4821 2.6932 0.6545 0.5888
hfenergy: -710.3739084 hartree
pointgroup: C01 [X(C6H11F1O5)]
dipole: -0.7428937 0.558911 -0.1368241 debye
dipolederiv: -0.3523744 0.0185069 -0.0011031 0.0334438 -0.8081136 -0.0517749 0.0090244 -0.1598373 -0.2874668 -0.3534127 0.0310512 0.1399531 0.0324712 -0.9167455 0.010644 0.1448334 -0.0158441 -0.4803889 -0.7863932 0.2195205 -0.1154104 0.2256128 -0.493854 -0.1172309 -0.1421519 -0.101014 -0.4642049 -0.7508006 -0.2525029 -0.0331429 -0.2586274 -0.4752498 0.1292293 -0.0153473 0.1442794 -0.5073188 -0.7718267 -0.2535949 -0.0456584 -0.2402896 -0.4667162 0.1671422 -0.0049998 0.1773945 -0.4773727 -0.7584686 0.2381445 -0.1219317 0.2388026 -0.4394107 -0.1086455 -0.1446238 -0.0997519 -0.4638701 0.1141641 -0.0841881 -0.0587292 -0.0534281 0.6053763 0.0810283 -0.0577537 0.0248732 0.3213416 0.534246 -0.1773472 0.1410945 -0.1686379 0.1928997 0.0166581 0.0810327 0.0496053 0.3292437 0.4161435 0.23174 -0.0793559 0.2551153 0.2910431 -0.0921624 -0.0336757 -0.0614414 0.3408931 0.4060998 0.2634184 -0.0791329 0.2795559 0.2345596 -0.1235867 -0.0587232 -0.0631091 0.3060136 0.5386055 -0.1784735 0.1499366 -0.1501555 0.1921433 -0.0042357 0.1155441 0.051712 0.3426008 0.2469077 -0.0558512 -0.0097246 -0.0269825 0.7650939 0.0972549 -0.0000033 0.0781469 0.3412046 0.0407516 -0.0015727 -0.0026552 0.0019003 -0.0238704 -0.0512231 0.0074586 -0.0615573 -0.1561421 0.0043204 0.0202892 -0.0322156 0.0207224 0.0319426 0.005036 -0.0443916 0.0019253 -0.1613139 -0.0039475 -0.0240707 0.0433631 -0.0159286 0.0311548 -0.0034338 0.0475738 0.0123074 -0.162893 -0.0047962 -0.0211481 0.036196 -0.0172395 0.033644 0.0053569 0.0383477 0.0136861 -0.1528237 0.0013864 0.007751 -0.0276834 0.0151516 0.0341571 0.0171854 -0.0469697 -0.0027108 -0.163897 0.0617303 0.0036928 0.009389 -0.0072756 0.0154544 -0.0053032 0.0070374 -0.0183184 -0.0852186 0.1461776 0.0743876 -0.0962706 0.0412603 0.3760099 -0.0241451 -0.1015965 -0.0240467 0.3244702 0.2640322 -0.1136692 0.0343176 -0.1478217 0.2793483 0.0920041 0.0423469 0.0960837 0.3047229 0.3764918 0.0967426 0.053781 0.0629639 0.1487542 -0.049486 0.0623645 -0.0537448 0.3344856 0.3598366 0.0904688 0.0622097 0.0384643 0.1234841 -0.0739362 0.0622822 -0.0833666 0.318309 0.2711263 -0.1332949 0.0327733 -0.1590779 0.2688947 0.0836243 0.0323908 0.0947286 0.2996253 unknown
polarizability: 89.1153477|1.6114749|87.9223226|0.4868539|-1.9487296|60.3759913 unknown
InChI: InChI=1S/C6H11FO5/c7-1-2(8)4(10)6(12)5(11)3(1)9/h1-6,8-12H
charge 0 multiplicity 1
23 atoms
F  0.221565 -2.748348 -0.241078
O  -0.12741 2.886719 0.065329
O  -2.484002 1.294961 -0.412288
O  2.388256 1.570627 -0.352593
O  -2.325507 -1.447988 0.411042
O  2.552162 -1.124891 0.564978
C  -0.091846 1.484186 -0.355674
C  -1.290202 0.696237 0.186697
C  1.210183 0.906174 0.209985
C  -1.159938 -0.788414 -0.186583
C  1.386442 -0.590033 -0.130305
C  0.160863 -1.388232 0.321352
H  -0.093422 1.419241 -1.465439
H  -1.333203 0.784715 1.294033
H  1.197585 1.032492 1.314635
H  -1.187202 -0.894143 -1.292809
H  1.507393 -0.68249 -1.231597
H  0.158351 -1.5149 1.419516
H  -1.010372 3.259188 -0.189081
H  -3.266185 0.747509 -0.144444
H  2.278655 2.546658 -0.216315
H  -2.30166 -2.411421 0.182475
H  3.318495 -0.533851 0.343062
