program: Gaussian 09
title: 000195093
version: EM64L-G09RevD.01
frameworkgroup: C1[X(C6H9NO2)]
method: RPBEPBE
basis: SDD
operation: Freq
keyword: #pfreq=noraman
keyword: PBEPBE/SDD
title: #p freq=noraman PBEPBE/SDD
converged: YES YES NO NO
title: Mulliken charges:
elementType: O O N C C C C C C H H H H H H H H H
charge: -0.240506 -0.436856 -0.535989 0.303050 0.357255 -0.538002 -0.519351 -0.301619 -0.428722 0.266775 0.229971 0.236883 0.283632 0.238026 0.200239 0.267608 0.281242 0.336364
chargesum: 0.00000
title: Mulliken charges with hydrogens summed into heavy atoms:
elementType: O O N C C C C C C
charge: -0.240506 -0.100492 0.012861 0.303050 0.357255 -0.271227 -0.052498 -0.017987 0.009543
polarizability: 1.01235936e+02 1.36178673e-01 7.42376602e+01 -9.50284770e-01 3.25211853e-01 5.18702146e+01
1716.lowfreq: -6.2397 -4.1999 0.0007 0.0008 0.0009 6.2370 49.6530 58.6242 113.4984
frequency: 49.6526 58.6065 113.4970 176.6214 213.0767 266.5238 323.5552 344.2437 383.4012 465.6044 591.0690 610.0837 641.8747 691.0690 746.2478 762.1477 821.5153 842.3894 903.5409 941.6064 980.0758 991.7637 1069.0822 1074.8518 1112.5155 1136.7378 1162.4228 1205.3431 1248.8771 1291.1152 1327.6746 1338.4887 1350.6629 1400.6534 1440.6778 1471.8963 1531.4393 1599.7908 1647.7609 2955.4738 3003.4866 3049.7595 3064.0404 3212.6465 3265.4570 3448.2444 3552.1952 3575.0406
redmass: 4.8375 2.4001 4.1558 3.2036 2.2045 1.6594 2.5948 1.5506 1.6693 3.7812 2.8640 3.6895 1.7876 3.7867 2.8820 1.5650 1.3819 1.7289 2.7319 3.5754 1.9577 4.2228 4.1294 4.1136 1.3959 2.0187 1.1370 1.3871 2.5578 1.4967 1.2312 1.2373 1.4549 2.1163 1.0801 1.0929 6.2836 6.2666 1.0839 1.0688 1.0611 1.0935 1.1023 1.0982 1.1001 1.0450 1.0660 1.0972
irintensity: 1.5471 2.6658 1.1667 3.8026 20.1287 10.6729 13.4678 129.0204 105.9055 6.6559 46.9451 13.8366 211.7448 19.3951 112.4148 38.5165 25.8727 13.9203 12.2804 70.5721 3.7358 19.6410 12.9663 15.6535 5.6869 19.9777 28.7218 3.2294 6.6564 1.4414 1.1896 10.3677 34.0243 5.6007 12.5199 3.3155 14.5184 1.2560 31.3650 64.7367 33.9349 19.2574 17.4023 1.8086 0.8834 2.5284 5.0107 1.8050
temp: 298.150 k
press: 1.00000 atm
elementType: 8 8 7 6 6 6 6 6 6 1 1 1 1 1 1 1 1 1
symmnumber: 1
zpe: 379542.2 jmol-1
zpe.correction: 0.144560 hartree
zpe.thermalcorrener: 0.153989 hartree
zpe.thermalcorrenthalpy: 0.154933 hartree
zpe.thermalcorrgfe: 0.109385 hartree
zpe.sumelectzpe: -438.494339 hartree
zpe.sumelectthermal: -438.484910 hartree
zpe.sumelectthermalent: -438.483966 hartree
zpe.sumelectthermalfe: -438.529514 hartree
dipole: -0.2869 0.9824 1.2696
dipole: 1.6307
quadrupole: -69.8045 -48.5119 -50.2867
quadrupole: 2.0624 1.5791 -1.4638
quadrupole: -13.6035 7.6891 5.9143 2.0624 1.5791 -1.4638
hfenergy: -438.6388992 hartree
pointgroup: C01 [X(C6H9N1O2)]
dipole: -0.0778412 -0.6361498 0.0293475 debye
dipolederiv: -0.636413 0.134046 -0.1189147 0.0705305 -0.3163949 0.1949964 -0.0525157 0.2032013 -0.3522396 -0.7257648 0.1808432 0.1787154 0.223755 -0.3671979 0.1140096 0.2559683 0.1364039 -0.4979041 -1.0776696 -0.1754195 -0.0527973 -0.1991939 -0.2541009 -0.0973435 -0.0667655 -0.0932816 -0.3992994 -0.0020299 0.0170732 0.0460184 0.118392 -0.0849953 0.0018075 -0.0145412 -0.0321693 -0.068511 0.1785001 -0.0613592 0.0069406 -0.008995 0.1141859 -0.2335356 0.0446643 -0.2315851 0.1085697 -0.2558176 0.0409423 -0.0635649 0.0786919 -0.1570827 -0.0788594 -0.0668073 -0.097933 -0.1095265 0.5957362 0.0664802 0.0767228 0.1198273 0.2522386 0.1043886 0.0452097 0.1270635 0.3990702 0.2005376 -0.120056 0.0924423 -0.1546644 -0.0315323 -0.1480532 0.1457536 -0.1148383 -0.0592277 0.5762255 -0.0475321 -0.1306211 -0.1299549 0.3787228 -0.0571082 -0.1711231 -0.0454137 0.5058977 0.1193625 -0.007365 0.011682 -0.0154733 0.0904355 0.1111741 0.015679 0.1112837 0.0642908 0.0387488 -0.0169455 -0.0364363 -0.039993 0.0370821 0.1211346 0.0062675 0.0714849 -0.088911 -0.0561255 0.04294 0.0092337 0.0720081 -0.0881465 -0.0775312 -0.0325021 -0.0273852 0.0855453 0.0675052 -0.0087979 0.016978 -0.0229462 0.1397697 0.0895652 0.0252967 0.0883495 0.1242873 -0.0438132 -0.0166939 -0.0627909 -0.0658708 0.026442 -0.1016144 -0.0223929 -0.0668125 -0.0295138 0.0025039 -0.0131501 0.0539434 0.0451539 -0.1531297 0.1406034 0.0188482 0.1014457 -0.0190545 0.2969202 0.1982588 0.0014663 0.1208583 0.0867384 -0.0466678 -0.050011 -0.0708273 0.1315432 0.3947336 -0.0625247 0.0897999 -0.0389503 0.1145688 0.0565608 -0.0042238 0.046836 0.0528468 0.32686 -0.1507398 -0.1188178 -0.1731754 0.2123962 -0.0935267 -0.0768048 -0.1058224 0.1521367 unknown
polarizability: 100.9982891|3.1280838|59.7396985|1.6104958|-10.5342277|66.6058231 unknown
InChI: InChI=1S/C6H9NO2/c7-2-6-1-5(3-8)4-9-6/h1,4,8H,2-3,7H2
charge 0 multiplicity 1
18 atoms
O  -0.698952 0.885195 -0.707008
O  3.520769 -0.067934 -0.570746
N  -3.31361 -0.815971 -0.650312
C  1.183201 0.012337 0.262722
C  -1.113146 -0.008072 0.311235
C  0.011384 -0.555321 0.909671
C  -2.601016 -0.184469 0.484262
C  0.709793 0.877477 -0.710891
C  2.629955 -0.275343 0.582309
H  0.009917 -1.276649 1.726063
H  -2.768282 -0.790967 1.392317
H  -3.0739 0.798217 0.668686
H  1.190272 1.529319 -1.433809
H  3.020238 0.421756 1.34455
H  2.729143 -1.306011 0.98568
H  -2.984144 -1.764421 -0.861586
H  -3.325465 -0.230925 -1.492652
H  3.178741 -0.605517 -1.330289
