program: Gaussian 09
title: 000195101
version: EM64L-G09RevD.01
frameworkgroup: C1[X(C14H24N2S2)]
method: RPBEPBE
basis: SDD
operation: Freq
keyword: #p
keyword: freq=noraman
keyword: PBEPBE/SDD
title: #p freq=noraman PBEPBE/SDD
converged: NO YES NO NO
title: Mulliken charges:
elementType: S S N N C C C C C C C C C C C C C C H H H H H H H H H H H H H H H H H H H H H H H H
charge: 0.031674 -0.013843 -0.025909 0.012737 -0.157198 -0.180046 -0.443343 -0.437354 -0.386618 -0.392789 -0.142922 -0.139015 -0.146819 -0.165767 -0.686286 -0.651833 -0.671701 -0.669419 0.185800 0.218650 0.208335 0.188846 0.208412 0.231202 0.220672 0.193253 0.185629 0.201797 0.217920 0.211477 0.223932 0.221421 0.261312 0.233259 0.237699 0.216329 0.217078 0.216266 0.263812 0.233352 0.243772 0.226224
chargesum: 0.00000
title: Mulliken charges with hydrogens summed into heavy atoms:
elementType: S S N N C C C C C C C C C C C C C C
charge: 0.031674 -0.013843 -0.025909 0.012737 0.028602 0.038604 -0.046161 0.002260 0.027307 -0.005363 -0.142922 -0.139015 0.071101 0.045710 0.020380 0.035454 0.025456 0.033929
polarizability: 2.34362914e+02 6.02456518e+00 2.18858437e+02 5.06833530e+00 4.71394742e+00 1.61002753e+02
1716.lowfreq: -12.1580 -0.0021 0.0009 0.0011 7.8119 14.5501 42.5525 72.0909 83.9388
frequency: 42.2122 71.6619 83.9348 101.2280 115.2099 134.2382 144.4842 154.4724 176.5199 181.5166 206.3732 212.4479 224.2905 232.3095 245.1498 248.7008 255.2747 283.3902 293.5447 306.9963 312.8908 325.2493 352.6327 382.2008 387.2766 398.6197 401.3448 445.0966 450.0499 463.5039 480.3534 506.2679 555.2639 596.3800 639.8957 662.0787 768.6710 802.0956 812.6435 827.9517 846.8248 896.0198 907.0769 929.1724 938.0337 943.2131 943.7431 954.7241 976.3892 985.5445 989.0900 1001.9779 1005.4045 1026.9148 1040.9600 1072.3571 1099.4855 1101.3607 1110.7565 1122.0647 1137.1666 1185.4273 1191.1016 1200.7539 1228.4745 1239.7559 1264.2512 1269.8221 1272.2746 1283.1815 1305.3091 1318.3546 1335.8118 1340.8270 1346.5613 1354.8303 1358.6195 1376.6747 1377.9641 1387.3889 1393.8117 1398.6382 1447.7395 1451.6091 1453.9311 1454.5396 1455.9483 1456.7723 1464.6048 1468.7946 1469.8338 1474.1133 1475.0733 1477.3511 1623.0734 1630.0563 2870.0975 2914.8919 2929.3121 2937.0354 2957.7718 2971.7641 2973.0490 2978.2501 2988.9644 2989.3079 2991.1493 3000.7806 3029.8286 3035.3546 3052.4258 3066.0892 3066.4441 3073.4272 3079.6380 3084.7303 3089.1835 3095.4491 3111.9356 3114.6920
redmass: 4.4302 3.2212 3.5577 4.1853 4.6224 4.4639 3.0622 2.9880 3.2653 1.1536 1.0768 2.5905 2.0766 2.6470 1.2157 1.2630 3.4673 2.7050 2.8627 2.4602 3.3622 3.5006 2.8959 3.8210 3.2121 3.2151 4.4438 7.8054 3.9204 3.3995 2.1757 3.6743 3.0953 3.1213 3.2458 3.1868 2.5888 2.2000 3.3197 2.4248 2.6702 2.0011 1.8322 2.3855 2.0013 1.4798 1.4396 1.5587 1.6268 1.7768 1.6412 1.4407 1.4933 2.6308 1.5939 1.6508 1.2832 1.6298 1.7072 2.2711 2.3314 3.1557 3.1612 1.7150 1.2597 1.3579 1.9739 3.2748 1.7586 1.3126 1.3097 1.3412 1.3879 1.3931 1.4228 1.3797 1.5487 1.1989 1.1961 1.3316 1.2109 1.2457 1.0490 1.0493 1.0829 1.0527 1.0850 1.0522 1.0831 1.0513 1.0544 1.0826 1.0685 1.0552 7.8931 8.1824 1.0813 1.0851 1.0821 1.0842 1.0646 1.0623 1.0376 1.0350 1.0585 1.0399 1.0363 1.0623 1.0949 1.0974 1.1035 1.1031 1.0978 1.0993 1.0989 1.0985 1.0992 1.0997 1.1004 1.0992
irintensity: 0.4559 0.2495 1.6384 2.7035 1.2596 0.6511 2.3612 4.9315 2.5726 0.7238 0.2320 2.7692 0.5356 2.6962 0.4746 0.2288 3.0433 1.2592 4.7955 0.5403 1.6802 1.7079 6.2544 0.1774 1.8266 0.3797 0.1171 0.2452 5.2311 1.0419 5.3034 0.4172 2.3454 10.4721 3.2664 2.6610 0.4635 7.4423 0.8546 4.2176 4.7320 9.2940 16.4732 10.0441 2.4428 0.3908 3.0030 2.1815 6.3012 0.1499 8.4151 4.4454 4.5248 10.7944 0.2557 2.2537 13.3887 106.7586 8.8517 5.9435 6.2330 4.4682 10.0567 0.2824 1.5575 2.4160 7.4094 3.3336 6.4405 1.0032 1.1321 1.5726 0.7736 2.2406 0.2059 6.6907 11.4852 24.7496 34.1742 36.1326 22.9045 12.7001 7.4263 3.7056 5.3780 3.7266 11.1500 2.3782 11.8203 12.6235 6.2772 22.1654 6.8454 15.6615 52.2120 64.1092 35.9993 33.4209 35.2542 53.5680 49.7093 51.4096 33.2607 24.1219 28.1628 33.8443 23.1961 22.0001 67.2452 40.4965 38.6990 44.8569 18.1093 16.6392 15.9750 8.7287 24.1945 18.7303 13.1059 12.9842
temp: 298.150 k
press: 1.00000 atm
elementType: 16 16 7 7 6 6 6 6 6 6 6 6 6 6 6 6 6 6 1 1 1 1 1 1 1 1 1 1 1 1 1 1 1 1 1 1 1 1 1 1 1 1
symmnumber: 1
zpe: 932773.5 jmol-1
zpe.correction: 0.355275 hartree
zpe.thermalcorrener: 0.375679 hartree
zpe.thermalcorrenthalpy: 0.376623 hartree
zpe.thermalcorrgfe: 0.308456 hartree
zpe.sumelectzpe: -1452.064679 hartree
zpe.sumelectthermal: -1452.044274 hartree
zpe.sumelectthermalent: -1452.043330 hartree
zpe.sumelectthermalfe: -1452.111497 hartree
dipole: 1.1909 -0.6908 -2.5464
dipole: 2.8948
quadrupole: -128.4741 -116.3695 -124.4909
quadrupole: 2.0273 -0.0773 2.3873
quadrupole: -5.3626 6.7420 -1.3794 2.0273 -0.0773 2.3873
hfenergy: -1452.4199534 hartree
pointgroup: C01 [X(C14H24N2S2)]
dipole: -0.453925 0.2261702 -1.0197347 debye
polarizability: 234.4210781|6.0484014|218.4589977|-4.0814076|-7.0474742|161.3440289 unknown
InChI: InChI=1S/C14H24N2S2/c1-13(2)9-15-11-7-5-6-8-12(11)16-10-14(3,4)18-17-13/h9-12H,5-8H2,1-4H3
charge 0 multiplicity 1
42 atoms
S  2.39501 -1.27284 1.147859
S  3.220907 0.160424 -0.393533
N  -0.984821 -1.131349 -0.241558
N  -0.160165 1.612666 0.309651
C  -1.627245 -0.036163 -1.001146
C  -1.544935 1.281837 -0.137381
C  -3.104222 -0.376588 -1.317873
C  -2.442858 1.20149 1.116307
C  -3.976153 -0.465906 -0.04623
C  -3.905127 0.851855 0.759993
C  1.099752 -2.411818 0.171658
C  2.254285 1.864402 -0.07447
C  0.2206 -1.459543 -0.600122
C  0.829805 1.628497 -0.529889
C  0.379275 -3.153638 1.309457
C  1.886626 -3.33941 -0.769335
C  2.386069 2.263492 1.396582
C  2.998001 2.819533 -1.036049
H  -1.090889 0.153266 -1.963981
H  -1.922633 2.094264 -0.79974
H  -3.137831 -1.327761 -1.882587
H  -3.505268 0.413857 -1.986055
H  -2.382934 2.167491 1.651179
H  -2.021643 0.430437 1.787281
H  -3.607816 -1.299045 0.58184
H  -5.022618 -0.695132 -0.325364
H  -4.352053 1.674655 0.161826
H  -4.506845 0.768775 1.685273
H  0.715718 -1.022125 -1.495514
H  0.730654 1.444882 -1.623974
H  -0.336778 -3.873611 0.871594
H  1.096831 -3.714038 1.935262
H  -0.192791 -2.452587 1.937341
H  2.457353 -2.758715 -1.51633
H  2.598276 -3.960496 -0.199141
H  1.188454 -4.00899 -1.309041
H  3.448825 2.376244 1.672041
H  1.861023 3.221594 1.567523
H  1.913494 1.510951 2.048181
H  2.569929 3.834917 -0.938778
H  4.071454 2.873538 -0.783417
H  2.900889 2.504192 -2.091137
