program: Gaussian 09
title: 000195140
version: EM64L-G09RevD.01
frameworkgroup: C1[X(C24H31NO3)]
method: RPBEPBE
basis: SDD
operation: Freq
keyword: #p
keyword: freq=noraman
keyword: PBEPBE/SDD
title: #p freq=noraman PBEPBE/SDD
converged: NO YES NO NO
title: Mulliken charges:
elementType: O O O N C C C C C C C C C C C C C C C C C C C C C C C C H H H H H H H H H H H H H H H H H H H H H H H H H H H H H H H
charge: -0.295124 -0.267147 -0.247180 -0.075802 0.009431 -0.435292 -0.443421 -0.393747 -0.390157 -0.568119 -0.362527 -0.253999 0.238542 -0.274582 0.485376 0.366887 -0.263297 -0.449748 -0.387106 -0.352479 -0.429492 -0.662569 -0.226219 -0.229145 -0.227396 -0.217821 -0.242878 -0.248660 0.226114 0.190133 0.202382 0.196417 0.222260 0.213123 0.173375 0.182406 0.211416 0.245042 0.247700 0.212681 0.198466 0.210487 0.197182 0.205421 0.222638 0.233298 0.233869 0.240450 0.254498 0.280520 0.247992 0.226966 0.216023 0.226228 0.223338 0.226450 0.222919 0.228357 0.225518
chargesum: 0.00000
title: Mulliken charges with hydrogens summed into heavy atoms:
elementType: O O O N C C C C C C C C C C C C C C C C C C C C C C C C
charge: -0.295124 -0.267147 -0.247180 -0.075802 0.235545 -0.042777 -0.024744 -0.007249 0.003665 -0.075376 0.048619 0.153670 0.238542 -0.069161 0.485376 0.366887 0.192639 -0.215879 -0.146656 -0.097981 -0.148972 0.028412 0.000009 -0.005807 -0.000946 0.005098 -0.014521 -0.023142
polarizability: 3.14186182e+02 -2.73444423e+01 2.80744001e+02 1.20273416e+01 -1.26965225e+01 2.11424554e+02
1716.lowfreq: -15.2070 -10.1447 -6.2991 -0.0015 -0.0005 0.0010 2.6281 5.7527 9.8065
frequency: -12.9776 -3.3692 6.6770 14.0742 21.4655 25.8607 37.0484 56.9752 58.8488 65.3182 78.3598 83.9760 108.3251 121.8650 147.3253 168.7386 184.4525 209.0661 211.7883 228.8376 236.7148 261.3183 267.1703 273.5831 294.2069 318.3956 339.7789 351.7075 401.4186 402.4059 404.2191 419.9224 439.6845 441.3481 463.3326 473.6019 499.3235 551.5046 566.6380 604.2070 614.8244 615.4690 620.1489 651.3975 658.3878 704.1665 705.1300 740.8738 757.0187 771.6181 782.1587 802.6537 812.4868 813.5930 827.3716 829.3126 855.7215 859.3334 860.8558 888.5869 901.3310 921.9368 935.3815 941.2529 947.2423 978.0341 978.6139 982.9626 983.1471 990.0710 990.7144 996.6233 998.6360 1012.6064 1020.7180 1026.0258 1029.3812 1036.2119 1075.4483 1079.0133 1080.8858 1088.3955 1094.6310 1098.2756 1100.7936 1114.3607 1123.2156 1142.2231 1146.4970 1155.6592 1166.0592 1170.0400 1171.9440 1179.9886 1185.4709 1188.6594 1191.1730 1208.8283 1214.4388 1251.4685 1260.4450 1268.6505 1270.6646 1279.0885 1285.9779 1290.2241 1291.9916 1314.8995 1318.4013 1326.9078 1335.0261 1337.0453 1342.0302 1353.1927 1356.8813 1361.5256 1377.9888 1382.9295 1386.2874 1389.8711 1401.7557 1433.6308 1433.8399 1442.0930 1448.7607 1456.3376 1457.0442 1462.9976 1463.5859 1472.3261 1478.8226 1480.3102 1481.5591 1484.5866 1488.4715 1591.5236 1594.9067 1609.9655 1614.6019 1638.7723 2824.3874 2835.8463 2892.9027 2901.8174 2949.6018 2971.3881 2973.9352 2977.1798 2985.4087 2992.0343 3005.1035 3023.9606 3027.7566 3034.3031 3040.7731 3044.7883 3046.2449 3053.3570 3087.2415 3091.1400 3111.5075 3117.3390 3118.0390 3124.8249 3126.2329 3136.2911 3139.9187 3147.6409 3157.6309 3162.9753 3177.9097
redmass: 3.7923 4.2407 3.7268 4.9959 3.8626 3.8145 3.4932 5.0802 4.7463 4.4613 4.1642 3.4361 2.5114 2.8812 3.9266 4.7705 4.3202 1.8313 2.8666 2.5213 1.8848 2.6770 3.7473 3.2957 3.9849 3.4336 3.3455 2.0820 2.8403 3.1073 3.4804 2.0536 3.5237 3.3886 3.3980 2.9796 3.8871 4.0335 3.4691 4.1344 4.7291 5.5696 3.0063 4.8361 4.1381 2.0345 1.6586 1.8351 3.2684 2.1451 2.0694 1.4026 1.3916 1.5740 2.9323 2.5072 1.2552 1.3864 2.5475 3.1256 2.0055 1.8503 1.7268 2.2651 1.8719 1.4392 2.0136 1.3858 1.7019 5.8295 6.2245 1.3269 1.3155 2.8525 4.0466 2.2879 2.5579 3.2786 1.8311 1.5889 1.8425 2.2432 2.2907 2.2351 2.2266 2.8188 2.2840 2.0506 1.5223 1.6839 1.4998 1.0657 1.0671 1.6078 1.1438 1.4676 1.3533 1.8384 1.5326 1.3923 1.3069 1.7561 1.2497 1.1188 1.1980 1.3659 1.3535 1.3431 1.2998 1.3565 1.3720 1.2896 1.4752 1.3895 1.3983 1.6146 1.5345 6.1857 5.8159 1.2341 1.4681 1.0920 2.2130 2.1287 1.0917 1.0923 1.0912 1.0436 1.0808 1.0794 1.1484 2.0891 2.2710 1.0508 1.0893 6.2667 6.1437 6.0564 6.1024 8.9129 1.0715 1.0703 1.0695 1.0821 1.0559 1.0637 1.0737 1.0629 1.0658 1.0360 1.1025 1.0879 1.0592 1.1020 1.0876 1.0959 1.0934 1.1009 1.0974 1.1034 1.0876 1.1059 1.0852 1.0859 1.0882 1.0911 1.0938 1.0960 1.0991 1.1014 1.0951
irintensity: 0.2439 0.2362 0.2152 0.0273 0.1737 0.0220 0.1426 0.6136 0.0554 1.2853 0.3749 0.3353 1.5905 5.5166 0.8756 1.7056 2.9257 2.2797 3.5927 2.0996 0.0329 3.3851 2.3924 5.6619 1.9747 12.7915 2.5687 4.6972 0.2498 3.5046 2.8583 1.8619 9.3729 2.8807 2.6483 1.1502 0.7592 7.6295 3.1476 16.3706 1.6128 1.7549 2.4067 15.5257 5.2222 43.0494 58.2682 68.7207 13.3651 33.6129 12.0014 0.5508 1.0486 1.3660 1.8820 5.0194 0.1932 1.6609 3.6618 14.5977 1.7080 9.2400 6.3609 5.3801 8.3166 4.1506 37.4274 0.2794 3.5676 1.5416 0.5256 1.6300 0.7033 55.9426 155.1126 40.2500 27.4022 39.8746 19.1640 1.6874 8.8930 59.3359 65.3878 8.2477 23.3605 164.7449 74.2899 33.6014 7.5598 16.3421 5.3219 1.0810 0.2939 8.1081 3.5264 8.3707 21.2573 5.4785 28.9717 15.4120 24.0089 13.4867 24.9943 4.9836 23.1345 15.9279 5.8230 4.4448 6.0940 8.4680 17.1289 2.9135 3.5051 0.1980 1.6052 20.9075 2.5726 2.3616 0.8314 21.6519 0.6624 19.6248 12.2772 12.4878 11.4404 13.9876 12.5313 13.8451 0.2490 0.8044 18.6765 5.1567 23.0332 12.9019 7.3796 1.4280 0.2049 3.3556 6.8502 136.0303 57.2966 117.2692 76.9788 35.4864 54.6719 20.0379 8.1146 29.6017 35.8152 19.3238 24.7118 39.5924 35.6750 25.5603 29.0795 21.5360 66.0867 50.6324 39.4522 0.8325 8.2723 35.1952 3.5039 0.0213 3.9322 14.8142 35.3094 32.8946 34.9510 23.8356 7.8103
temp: 298.150 k
press: 1.00000 atm
elementType: 8 8 8 7 6 6 6 6 6 6 6 6 6 6 6 6 6 6 6 6 6 6 6 6 6 6 6 6 1 1 1 1 1 1 1 1 1 1 1 1 1 1 1 1 1 1 1 1 1 1 1 1 1 1 1 1 1 1 1
symmnumber: 1
zpe: 1307843.4 jmol-1
zpe.correction: 0.498131 hartree
zpe.thermalcorrener: 0.524152 hartree
zpe.thermalcorrenthalpy: 0.525096 hartree
zpe.thermalcorrgfe: 0.436887 hartree
zpe.sumelectzpe: -1211.458499 hartree
zpe.sumelectthermal: -1211.432479 hartree
zpe.sumelectthermalent: -1211.431535 hartree
zpe.sumelectthermalfe: -1211.519743 hartree
dipole: -1.7329 1.1443 -1.4143
dipole: 2.5125
quadrupole: -152.6889 -153.7896 -168.3038
quadrupole: -1.4325 4.9712 -2.1879
quadrupole: 5.5718 4.4712 -10.0430 -1.4325 4.9712 -2.1879
hfenergy: -1211.9566304 hartree
pointgroup: C01 [X(C24H31N1O3)]
dipole: -0.6794643 0.3556711 -0.6236645 debye
polarizability: 314.3005421|-24.7264858|274.9805619|16.9934515|-22.5520738|217.0736334 unknown
InChI: InChI=1S/C24H31NO3/c1-2-27-23(26)19-20-13-15-25(16-14-20)17-18-28-24(21-9-5-3-6-10-21)22-11-7-4-8-12-22/h3-12,20,24H,2,13-19H2,1H3
charge 0 multiplicity 1
59 atoms
O  2.264001 -0.929296 0.169638
O  -7.716708 0.045065 -0.666931
O  -6.548779 0.088593 1.352841
N  -1.417941 -1.571759 0.008636
C  -4.371196 -1.476218 0.149149
C  -3.602132 -2.684432 -0.437541
C  -3.50416 -0.201196 0.009173
C  -2.202932 -2.817368 0.195775
C  -2.10885 -0.410507 0.627414
C  -5.750369 -1.322158 -0.52583
C  -0.006018 -1.701144 0.44289
C  0.904969 -0.768515 -0.368642
C  -6.665765 -0.331254 0.177658
C  3.286717 -0.195998 -0.602233
C  3.074458 1.317778 -0.514107
C  4.658279 -0.648846 -0.092179
C  -8.72546 0.994474 -0.100172
C  2.7504 2.070299 -1.66773
C  5.826939 0.000794 -0.564948
C  3.16934 1.978716 0.737294
C  4.788303 -1.729494 0.812346
C  -8.282026 2.444439 -0.313968
C  2.531949 3.465528 -1.580566
C  7.105244 -0.425871 -0.144706
C  2.94549 3.368314 0.829393
C  6.06904 -2.151517 1.239083
C  2.628455 4.117241 -0.330638
C  7.231563 -1.505479 0.761169
H  -4.538643 -1.654717 1.231787
H  -4.16987 -3.621556 -0.269397
H  -3.484879 -2.552961 -1.531814
H  -3.385245 0.04758 -1.064443
H  -4.000629 0.651585 0.50858
H  -1.652902 -3.650934 -0.27928
H  -2.318249 -3.070072 1.283811
H  -2.216348 -0.55614 1.735358
H  -1.493799 0.494931 0.477366
H  -6.278615 -2.298255 -0.536575
H  -5.649921 -1.019824 -1.585096
H  0.325867 -2.742084 0.275524
H  0.129775 -1.486091 1.530498
H  0.582335 0.288719 -0.281149
H  0.878325 -1.053654 -1.441916
H  3.190926 -0.492269 -1.674071
H  -9.646764 0.756864 -0.655954
H  -8.856708 0.76956 0.972949
H  2.667381 1.563818 -2.638251
H  5.735073 0.849435 -1.253621
H  3.41789 1.395062 1.630949
H  3.883117 -2.224036 1.173782
H  -7.364349 2.661093 0.258192
H  -8.093774 2.645022 -1.382833
H  -9.074976 3.132986 0.032995
H  2.284444 4.038694 -2.481208
H  7.999919 0.084942 -0.518657
H  3.020508 3.871014 1.80039
H  6.1578 -2.987011 1.943188
H  2.458504 5.197502 -0.258587
H  8.223194 -1.835788 1.090917
