program: Gaussian 09
title: 000195095
version: EM64L-G09RevD.01
frameworkgroup: C1[X(C19H16F2N4O3)]
method: RPBEPBE
basis: SDD
operation: Freq
keyword: #p
keyword: freq=noraman
keyword: PBEPBE/SDD
title: #p freq=noraman PBEPBE/SDD
converged: NO YES NO NO
title: Mulliken charges:
elementType: F F O O O N N N N C C C C C C C C C C C C C C C C C C C H H H H H H H H H H H H H H H H
charge: -0.200777 -0.198051 -0.226165 -0.386711 -0.216802 -0.171806 -0.289378 -0.365805 0.032657 -0.414484 -0.390432 -0.404216 -0.401087 0.358630 -0.525986 0.397984 0.189371 0.183512 -0.561985 0.066117 0.463510 -0.125445 -0.341119 -0.344982 0.122376 -0.356104 -0.362799 0.324984 0.252499 0.219255 0.257951 0.231704 0.223703 0.202372 0.196065 0.227091 0.276727 0.275629 0.304870 0.281605 0.280647 0.265251 0.263819 0.385807
chargesum: 0.00000
title: Mulliken charges with hydrogens summed into heavy atoms:
elementType: F F O O O N N N N C C C C C C C C C C C C C C C C C C C
charge: -0.200777 -0.198051 -0.226165 -0.000904 -0.216802 -0.171806 -0.012651 -0.365805 0.032657 0.057270 0.099223 0.021859 0.022069 0.358630 -0.250357 0.397984 0.189371 0.183512 -0.257115 0.066117 0.463510 -0.125445 -0.059514 -0.064335 0.122376 -0.090853 -0.098980 0.324984
polarizability: 3.53374073e+02 2.71486065e+01 3.10210305e+02 -2.26270875e+01 5.57904809e+00 1.54035348e+02
1716.lowfreq: -5.1359 -0.0004 -0.0004 0.0008 3.5502 5.6062 21.8234 32.4711 33.9742
frequency: 21.7008 32.4653 33.9576 45.6383 52.7177 54.8895 65.5173 71.7827 106.8661 136.9323 153.8734 165.8631 190.0488 220.3484 234.9142 241.9394 253.8669 267.0759 285.3454 319.3858 334.1149 351.1302 364.2135 375.7793 401.1635 412.0629 415.6856 434.6654 443.2767 453.0559 473.8497 486.0782 520.7737 526.6150 535.9401 541.7672 571.0184 586.4778 590.0145 624.7601 630.6299 636.3292 655.0736 666.1874 695.1377 696.9339 709.1492 741.6947 754.6572 777.5686 797.3635 809.6161 814.3384 829.0688 839.3305 844.4750 853.8231 902.4684 912.8208 918.4155 941.3971 956.7072 964.0577 1003.9402 1020.1059 1036.0986 1044.0641 1050.2418 1068.9161 1103.4582 1107.3696 1121.3335 1127.9013 1156.4694 1158.3017 1167.0849 1188.3001 1192.6088 1198.8569 1224.3213 1242.2521 1256.5896 1266.1923 1276.2383 1289.9794 1304.3732 1319.5011 1332.0458 1346.0700 1351.6779 1376.2439 1379.3537 1386.4810 1405.6905 1411.9144 1444.4612 1455.8093 1460.6056 1465.9425 1468.5929 1477.6040 1483.1180 1493.7804 1518.3332 1537.7646 1571.0584 1602.4073 1612.0022 1626.5078 1647.9113 2866.9305 2874.2912 3001.1882 3011.7296 3042.5174 3045.3314 3090.7097 3145.7568 3157.1002 3168.4328 3170.5016 3180.4859 3188.3910 3191.5171 3479.3975 3511.8502
redmass: 6.5811 8.1475 7.0712 4.8913 6.1856 4.9116 6.5549 5.3008 7.0753 6.1686 9.5218 4.8845 7.7186 3.7844 5.1846 7.3229 5.9095 11.6244 3.3235 6.1451 5.7648 6.6921 7.4864 3.5972 5.3855 3.7633 3.5784 2.6921 4.9846 3.3996 2.9948 3.7689 2.9418 3.7576 3.3143 3.5186 3.3008 3.3597 3.2366 5.2958 5.1975 4.1440 1.7298 6.1889 5.3953 4.1589 4.4539 7.3628 6.7606 6.2796 6.6743 1.5333 3.5197 1.6453 1.5740 1.6217 3.0799 2.5008 1.4227 3.3201 1.3843 1.3531 4.2343 2.7628 2.7201 3.8080 1.9844 1.7913 3.2815 1.7898 1.7247 3.4690 2.1424 1.3553 4.2694 3.0569 1.8264 1.3122 2.1788 1.8876 1.7549 1.5163 1.8298 1.6734 1.3182 3.0030 1.2535 1.2260 4.3708 1.3493 2.8255 3.9545 2.8143 2.6641 3.7430 1.3386 3.8603 1.1120 1.0932 1.1040 7.5026 1.2766 3.0910 4.9424 8.2652 10.8997 8.0767 6.5277 7.8848 9.7808 1.0713 1.0697 1.0654 1.0689 1.0890 1.0911 1.0980 1.0953 1.0896 1.0922 1.0893 1.0968 1.0980 1.0897 1.0758 1.0640
irintensity: 0.5532 1.8786 0.3430 0.6275 0.6714 1.1711 0.5838 0.4139 0.2834 1.7522 2.0028 0.6828 2.5952 2.6799 5.5959 0.6631 1.9469 2.7534 6.5346 5.1335 1.2926 1.3256 2.7284 5.0693 4.8557 28.3633 16.0205 1.9952 2.2197 8.4507 11.7326 7.9206 7.4280 76.4718 42.7380 44.8052 47.9480 9.0338 124.3783 12.6990 7.6549 29.2714 105.2284 7.8410 0.8907 10.0398 1.2389 48.4233 9.8215 11.9922 6.8437 5.2424 19.2234 57.5331 4.7251 13.5092 8.3427 1.5114 22.2388 20.5960 1.4396 0.9256 3.6664 10.3652 82.6571 361.5483 30.4751 4.6467 16.8863 12.5766 3.5052 26.5616 13.9109 48.9097 49.0786 18.5323 54.5418 60.9165 21.2141 9.1156 16.0619 63.6857 5.4791 43.9804 7.1829 37.0822 31.0803 14.7629 35.5724 7.0388 18.0688 1.3454 50.4503 21.2843 0.8853 6.6614 62.4050 7.0252 14.2045 8.8446 177.3647 50.3817 205.5963 328.9495 51.9836 343.1501 7.9922 19.0982 340.0347 209.0155 45.9831 101.7901 36.3460 54.8918 44.8304 73.3012 19.5726 4.1733 5.2952 6.8906 2.4821 0.6465 0.2135 4.6117 0.2116 35.8578
temp: 298.150 k
press: 1.00000 atm
elementType: 9 9 8 8 8 7 7 7 7 6 6 6 6 6 6 6 6 6 6 6 6 6 6 6 6 6 6 6 1 1 1 1 1 1 1 1 1 1 1 1 1 1 1 1
symmnumber: 1
zpe: 853241.4 jmol-1
zpe.correction: 0.324982 hartree
zpe.thermalcorrener: 0.348720 hartree
zpe.thermalcorrenthalpy: 0.349664 hartree
zpe.thermalcorrgfe: 0.269880 hartree
zpe.sumelectzpe: -1375.955130 hartree
zpe.sumelectthermal: -1375.931393 hartree
zpe.sumelectthermalent: -1375.930448 hartree
zpe.sumelectthermalfe: -1376.010233 hartree
dipole: 6.4936 4.0732 0.2015
dipole: 7.6680
quadrupole: -153.8677 -181.3355 -156.8114
quadrupole: -1.4439 11.8536 -0.2834
quadrupole: 10.1371 -17.3306 7.1935 -1.4439 11.8536 -0.2834
hfenergy: -1376.2801125 hartree
pointgroup: C01 [X(C19H16F2N4O3)]
dipole: -2.3829765 1.8437088 0.1530578 debye
polarizability: 334.4230958|-36.2069929|313.9931349|-51.693966|-13.4931291|169.2034948 unknown
InChI: InChI=1S/C19H16F2N4O3/c20-11-1-3-12(4-2-11)25-15-10-16(24-7-5-22-6-8-24)14(21)9-13(15)18(26)17(23-25)19(27)28/h1-4,9-10,22,27H,5-8H2
charge 0 multiplicity 1
44 atoms
F  -2.832371 -3.105959 1.62389
F  1.264268 5.844218 -0.512204
O  1.986656 -3.863063 0.050286
O  4.782776 -2.766112 0.007965
O  4.591608 -1.794063 -2.096413
N  -3.395572 -0.320371 1.181238
N  -5.50955 0.963593 -0.264757
N  1.325584 0.215167 -0.190567
N  2.535783 -0.302814 -0.585533
C  -3.617407 1.141602 1.274779
C  -4.673773 -1.03799 0.917234
C  -4.249052 1.695965 -0.025209
C  -5.317565 -0.497208 -0.382848
C  -2.139962 -0.855998 0.89984
C  -1.048886 -0.04891 0.465827
C  0.239641 -0.593006 0.24075
C  -1.834788 -2.254539 1.090991
C  0.472033 -1.998259 0.366939
C  -0.60145 -2.814454 0.811352
C  1.762285 -2.608731 0.004117
C  1.2699 1.660155 -0.272455
C  2.749108 -1.617233 -0.487034
C  1.726057 2.295027 -1.451468
C  0.842539 2.426139 0.838897
C  4.105398 -2.049389 -0.973622
C  1.726982 3.702148 -1.537281
C  0.834074 3.834761 0.761015
C  1.271744 4.439973 -0.430274
H  -4.335354 1.312144 2.099898
H  -2.679891 1.661701 1.526726
H  -4.502956 -2.118747 0.841795
H  -5.360276 -0.845218 1.762872
H  -4.471239 2.770969 0.102594
H  -3.512768 1.592339 -0.86111
H  -4.664948 -0.785201 -1.244627
H  -6.301696 -0.97986 -0.524137
H  -6.075877 1.363525 -1.021199
H  -1.220904 1.005425 0.249539
H  -0.423682 -3.885842 0.94624
H  2.094039 1.684569 -2.280117
H  0.546631 1.929518 1.767653
H  2.073715 4.218663 -2.436378
H  0.519036 4.451825 1.606997
H  5.647909 -3.096159 -0.359198
