program: Gaussian 09
title: 000195031
version: EM64L-G09RevD.01
frameworkgroup: C1[X(C11H15NO4S)]
method: RPBEPBE
basis: SDD
operation: Freq
keyword: #p
keyword: freq=noraman
keyword: PBEPBE/SDD
title: #p freq=noraman PBEPBE/SDD
converged: YES YES NO NO
title: Mulliken charges:
elementType: S O O O O N C C C C C C C C C C C H H H H H H H H H H H H H H H
charge: 0.925895 -0.550436 -0.557514 -0.458378 -0.214346 -0.592365 0.184537 -0.632275 -0.777792 -0.703428 0.525596 0.199250 -0.354816 -0.343369 -0.218113 -0.219295 -0.227230 0.315392 0.275152 0.265717 0.282607 0.232393 0.226876 0.276390 0.284328 0.301707 0.239897 0.238257 0.231242 0.230719 0.380911 0.232495
chargesum: 0.00000
title: Mulliken charges with hydrogens summed into heavy atoms:
elementType: S O O O O N C C C C C C C C C C C
charge: 0.925895 -0.550436 -0.557514 -0.077468 -0.214346 -0.006330 0.184537 -0.041732 -0.229469 0.032231 0.525596 0.199250 -0.114919 -0.105112 0.013129 0.011423 0.005264
polarizability: 2.49391062e+02 -8.28073038e+00 1.56905707e+02 7.43284854e+00 -1.07698059e+01 1.18982462e+02
1716.lowfreq: -3.5146 -0.0019 -0.0011 0.0004 2.7266 15.2386 17.5574 31.5707 48.0468
frequency: 17.2838 31.3606 47.6888 50.6205 73.4743 90.4075 117.9276 144.8294 179.3854 192.1358 207.5061 214.4314 243.1365 246.5817 277.6466 314.2397 323.5728 349.2847 351.3264 365.3388 401.4159 404.0512 455.8319 506.7444 519.7935 535.3318 546.7337 569.6251 596.2291 615.1562 617.1026 693.2527 694.0432 707.8656 769.6705 791.4926 813.3932 846.0970 847.0886 863.4237 907.1082 925.9714 940.2654 975.1536 976.9858 989.4028 997.9434 999.7123 1026.5468 1031.8735 1072.3629 1088.0868 1120.5913 1154.1078 1176.0773 1178.4126 1193.3731 1204.7198 1236.5271 1252.2793 1283.5065 1319.1597 1331.2391 1389.2097 1390.4778 1407.0599 1432.9363 1443.5353 1462.3863 1484.6647 1490.1848 1589.5586 1611.5279 1626.2659 1674.1194 3003.0956 3052.4961 3054.1750 3103.4847 3120.2767 3129.2217 3135.1329 3145.2813 3146.9772 3151.8796 3156.2403 3169.8130 3465.2519 3517.2501 3604.2053
redmass: 6.6407 4.3047 5.1726 5.4144 7.5099 7.2050 6.6204 4.1017 7.0618 7.7019 5.9083 2.2295 1.3063 3.4392 2.2075 1.6641 6.6107 2.3256 2.3660 3.0075 2.8247 5.3250 6.0781 3.4165 4.1166 3.9195 1.5563 3.0689 1.5867 5.1276 3.7339 2.0797 2.7604 5.5007 2.1255 7.3568 4.1061 1.3868 1.8374 2.3695 2.2735 1.4535 2.6389 1.8106 1.3971 5.5082 1.7683 1.3768 2.1882 1.8956 1.4128 1.2910 1.1655 2.4363 1.0535 1.1884 1.1127 1.5289 2.8841 1.4644 2.3091 2.4287 1.2730 4.6452 1.3377 1.1166 1.1663 2.2174 1.0538 2.3399 1.0516 5.9326 5.9891 1.0976 8.8748 1.0356 1.0559 1.0563 1.1004 1.1007 1.0850 1.0882 1.0927 1.1120 1.1104 1.0971 1.1018 1.0442 1.0641 1.1001
irintensity: 1.1722 0.3643 1.3834 3.4021 1.8797 1.0732 8.4111 1.8656 2.9868 11.0426 0.5146 0.5190 9.3840 17.4254 43.5991 25.3459 13.9596 4.5432 5.1414 6.8170 1.3424 32.2914 83.8120 18.0717 12.8977 15.1369 159.7007 50.4543 107.2626 10.5631 23.1414 36.4435 16.5352 64.5744 13.0252 54.7798 3.8620 8.2043 14.3507 29.3777 33.8607 1.4916 56.5761 4.3395 0.2145 0.3359 77.7908 1.9099 4.2594 111.5905 7.7226 20.6437 1.8811 14.7562 0.0186 16.2260 0.1730 32.1078 19.2773 8.3701 49.9506 4.6149 0.5837 8.9474 41.2967 8.4238 3.9897 13.3313 4.3251 6.5156 7.5185 0.4501 2.5294 38.5175 218.0271 20.3011 3.4585 9.2882 13.1595 2.3796 1.2815 0.2882 17.4597 0.9478 1.8576 29.0331 20.5662 6.3142 23.8702 6.6505
temp: 298.150 k
press: 1.00000 atm
elementType: 16 8 8 8 8 7 6 6 6 6 6 6 6 6 6 6 6 1 1 1 1 1 1 1 1 1 1 1 1 1 1 1
symmnumber: 1
zpe: 645807.8 jmol-1
zpe.correction: 0.245975 hartree
zpe.thermalcorrener: 0.264515 hartree
zpe.thermalcorrenthalpy: 0.265459 hartree
zpe.thermalcorrgfe: 0.197883 hartree
zpe.sumelectzpe: -1180.433642 hartree
zpe.sumelectthermal: -1180.415103 hartree
zpe.sumelectthermalent: -1180.414159 hartree
zpe.sumelectthermalfe: -1180.481734 hartree
dipole: 0.5587 1.4172 5.4099
dipole: 5.6203
quadrupole: -87.8113 -111.1267 -110.9250
quadrupole: -4.9202 7.0059 0.6750
quadrupole: 15.4764 -7.8391 -7.6373 -4.9202 7.0059 0.6750
hfenergy: -1180.6796175 hartree
pointgroup: C01 [X(C11H15N1O4S1)]
dipole: 0.2395186 0.6248253 2.1075021 debye
polarizability: 249.0884113|-9.9010584|156.4866659|7.0197192|-12.1435014|119.7041533 unknown
InChI: InChI=1S/C11H15NO4S/c1-11(12,10(13)14)8-17(15,16)7-9-5-3-2-4-6-9/h2-6,13H,7-8,12H2,1H3
charge 0 multiplicity 1
32 atoms
S  0.253479 -1.02496 -0.144644
O  0.431548 0.152341 -1.279566
O  -0.280369 -2.508527 -0.581738
O  2.029928 1.455486 1.100872
O  3.334048 1.840066 -0.785654
N  4.291551 -0.694612 0.952464
C  3.107762 -0.492796 0.079538
C  1.971251 -1.280778 0.756722
C  -0.978745 -0.304981 1.298916
C  3.425123 -1.024098 -1.331663
C  -2.303878 -0.016691 0.700692
C  2.82192 1.027355 0.00553
C  -3.323011 -1.008388 0.698596
C  -2.556211 1.240578 0.085878
C  -4.577661 -0.738313 0.114393
C  -3.811261 1.507495 -0.498414
C  -4.825696 0.520755 -0.482076
H  2.135561 -2.366272 0.687591
H  1.792539 -0.95243 1.792537
H  -0.961544 -1.134808 2.022037
H  -0.399698 0.568709 1.632525
H  4.264114 -0.455935 -1.769165
H  3.696175 -2.091919 -1.271994
H  2.55359 -0.89553 -1.993095
H  4.252316 -0.236216 1.86778
H  5.190233 -0.589677 0.473414
H  -3.123905 -1.9890 1.145576
H  -1.762243 1.994855 0.054753
H  -5.357947 -1.506934 0.11638
H  -3.998049 2.4769 -0.972802
H  1.932019 2.444418 1.04833
H  -5.80044 0.729107 -0.937112
