program: Gaussian 09
title: 000195066
version: EM64L-G09RevD.01
frameworkgroup: C1[X(C12H12FNO7)]
method: RPBEPBE
basis: SDD
operation: Freq
keyword: #p
keyword: freq=noraman
keyword: PBEPBE/SDD
title: #p freq=noraman PBEPBE/SDD
converged: YES YES NO NO
title: Mulliken charges:
elementType: F O O O O O O O N C C C C C C C C C C C C H H H H H H H H H H H H
charge: -0.207786 -0.299536 -0.406421 -0.402047 -0.232353 -0.240529 -0.415358 -0.226340 -0.199388 0.408422 -0.482178 -0.523409 0.181223 -0.495176 -0.311197 0.333172 -0.385573 0.205957 0.202071 -0.361184 0.205449 0.267520 0.279668 0.269711 0.343493 0.266402 0.255040 0.258612 0.312594 0.249967 0.386650 0.380261 0.382263
chargesum: 0.00000
title: Mulliken charges with hydrogens summed into heavy atoms:
elementType: F O O O O O O O N C C C C C C C C C C C C
charge: -0.207786 -0.299536 -0.019771 -0.021785 -0.232353 -0.240529 -0.033096 -0.226340 -0.199388 0.408422 0.065011 0.089795 0.181223 -0.228774 -0.056157 0.333172 -0.126961 0.205957 0.202071 0.201377 0.205449
polarizability: 1.81540642e+02 -7.41456062e+00 1.59713546e+02 2.05241435e+00 1.15449210e+01 1.33331714e+02
1716.lowfreq: -3.9398 -0.0007 0.0002 0.0003 5.4424 8.8944 26.0678 36.8301 39.7035
frequency: 26.0645 36.8084 39.6984 46.1249 49.8630 55.5981 58.5763 64.6386 77.3443 130.9444 159.8027 177.0759 187.4496 199.9552 222.3033 288.8945 294.1621 320.1257 348.4486 369.2251 397.6850 424.0356 459.4607 469.9310 479.5643 488.4548 497.7825 508.3092 530.1848 564.0973 589.0343 596.8415 604.0605 636.8624 642.9973 646.8944 665.5780 700.5961 736.9802 755.0696 808.7121 828.4995 846.2972 854.7091 871.8810 903.8504 935.0139 959.2114 967.6884 968.5185 990.7592 1044.3312 1047.8911 1055.1331 1065.6093 1103.6126 1144.6525 1167.5929 1181.6472 1215.2110 1233.9776 1240.3785 1254.7706 1263.0303 1280.7671 1284.9515 1334.8888 1355.7581 1363.7650 1370.5007 1387.9564 1423.5548 1436.8981 1450.6394 1469.0051 1486.4863 1584.0295 1615.5288 1659.8483 1666.8043 1680.3273 2963.7565 2982.9480 3016.1281 3039.0964 3051.9052 3076.1497 3161.2227 3177.7267 3187.4763 3507.7232 3516.8346 3517.7938
redmass: 8.1190 8.5448 7.4351 8.7939 11.0586 10.6532 7.2707 7.7748 7.0837 3.3408 5.8486 4.6851 6.3929 6.6965 6.4528 7.1362 5.5340 4.1531 5.6590 4.2718 6.8932 3.8139 3.4303 4.7022 2.8330 1.7578 3.4434 2.5728 3.1297 4.0649 4.0141 3.7092 3.8759 1.4435 1.5017 1.6346 5.5651 6.2469 3.1016 5.8423 1.5955 4.7146 1.8821 3.2971 4.0904 5.1174 1.3658 2.6562 3.5577 3.4448 2.0819 2.6185 2.5841 2.3921 2.2117 1.4813 2.0553 2.0291 1.9065 1.2412 1.5571 1.6042 1.6250 1.6858 1.6479 2.0011 2.4048 1.5970 1.8077 8.2345 1.5496 2.5984 1.1535 1.1173 1.1834 3.3990 7.2807 7.7706 8.2096 8.5008 8.8024 1.0622 1.0638 1.0637 1.0952 1.1000 1.0980 1.0894 1.0919 1.0970 1.0642 1.0641 1.0642
irintensity: 0.0204 0.4588 1.2106 0.7269 0.3544 0.6914 1.0851 1.9554 3.0238 4.7544 2.1255 2.0407 0.1210 1.6858 2.0142 3.8151 0.3797 5.3600 2.4873 5.2387 10.1765 4.6669 20.0812 35.6654 7.9789 18.0157 48.7192 27.2054 55.5881 36.0530 37.5090 1.6200 29.4714 61.1365 118.8475 184.9765 12.9865 1.3277 16.0385 12.5401 27.3035 7.0722 28.8546 23.5896 9.3806 36.1597 0.8096 78.0757 69.6849 124.7348 29.0783 428.6925 38.4056 228.3308 199.6418 10.6544 91.6952 23.5996 28.9215 7.1417 21.1255 4.2670 24.8687 20.8069 33.4089 39.9865 20.1718 33.1823 17.4593 9.5717 10.9426 49.1793 25.6400 20.5823 40.6412 215.1098 24.8223 68.2022 176.5176 158.9610 257.8587 63.9458 28.9866 28.5096 4.0563 11.9831 13.8624 3.8360 0.5898 1.3800 21.7523 33.0800 37.6537
temp: 298.150 k
press: 1.00000 atm
elementType: 9 8 8 8 8 8 8 8 7 6 6 6 6 6 6 6 6 6 6 6 6 1 1 1 1 1 1 1 1 1 1 1 1
symmnumber: 1
zpe: 613391.0 jmol-1
zpe.correction: 0.233628 hartree
zpe.thermalcorrener: 0.254217 hartree
zpe.thermalcorrenthalpy: 0.255161 hartree
zpe.thermalcorrgfe: 0.181366 hartree
zpe.sumelectzpe: -1144.065848 hartree
zpe.sumelectthermal: -1144.045260 hartree
zpe.sumelectthermalent: -1144.044315 hartree
zpe.sumelectthermalfe: -1144.118110 hartree
dipole: -2.3835 0.5581 2.0997
dipole: 3.2251
quadrupole: -125.8354 -111.2774 -108.7369
quadrupole: -0.1485 -4.5545 2.2153
quadrupole: -10.5521 4.0058 6.5463 -0.1485 -4.5545 2.2153
hfenergy: -1144.2994763 hartree
pointgroup: C01 [X(C12H12F1N1O7)]
dipole: -0.8969964 -0.8249304 -0.3534111 debye
polarizability: 164.7624802|8.5091302|170.5699095|-19.5385481|-6.5986422|139.2535122 unknown
InChI: InChI=1S/C12H12FNO7/c13-7-1-2-9(21-6-12(19)20)8(3-7)14(4-10(15)16)5-11(17)18/h1-3,15,17,19H,4-6H2
charge 0 multiplicity 1
33 atoms
F  3.13667 2.868915 -1.64519
O  -1.255881 1.11268 1.362758
O  0.20916 -1.796715 -3.638709
O  1.554386 -2.48008 2.94281
O  -1.330547 -0.516304 -2.462664
O  2.681835 -1.850556 1.009156
O  -4.597377 -0.140918 0.818996
O  -2.868167 -1.145515 2.005422
N  0.268491 -0.798354 -0.104252
C  0.637535 0.579262 -0.136671
C  0.55373 -1.630074 -1.269945
C  0.230119 -1.46775 1.201157
C  -0.120186 1.532059 0.616567
C  1.728248 1.056863 -0.908756
C  0.249176 2.888946 0.660763
C  2.042828 2.423564 -0.871754
C  1.349008 3.360981 -0.090311
C  -0.302731 -1.22533 -2.471595
C  1.617321 -1.925611 1.661418
C  -2.423329 0.793561 0.517527
C  -3.260504 -0.260007 1.219831
H  0.293193 -2.679168 -1.033174
H  1.61883 -1.654017 -1.573847
H  -0.437161 -2.349152 1.174153
H  -0.215778 -0.79814 1.956057
H  2.360025 0.381764 -1.491179
H  -0.35208 3.571634 1.268626
H  1.645423 4.412755 -0.08824
H  -2.104972 0.387589 -0.465354
H  -3.027215 1.704461 0.355281
H  -0.370296 -1.560194 -4.413035
H  2.462375 -2.776273 3.225151
H  -5.132331 -0.876177 1.224798
