program: Gaussian 09
title: 000195045
version: EM64L-G09RevD.01
frameworkgroup: C1[X(C18H23ClO2)]
method: RPBEPBE
basis: SDD
operation: Freq
keyword: #p
keyword: freq=noraman
keyword: PBEPBE/SDD
title: #p freq=noraman PBEPBE/SDD
converged: YES YES NO NO
title: Mulliken charges:
elementType: Cl O O C C C C C C C C C C C C C C C C C C H H H H H H H H H H H H H H H H H H H H H H H
charge: -0.063587 -0.280683 -0.246302 0.188132 -0.218840 -0.763896 -0.760251 -0.178769 -0.491313 -0.184281 -0.384366 -0.493697 -0.358522 0.500332 0.269990 -0.391511 -0.406044 -0.234837 -0.226816 -0.112771 -0.510299 0.232455 0.230500 0.216877 0.216372 0.222164 0.227035 0.212627 0.223723 0.203459 0.235289 0.237634 0.202025 0.229863 0.240219 0.248793 0.242410 0.251516 0.235372 0.256541 0.254161 0.238221 0.244106 0.246968
chargesum: 0.00000
title: Mulliken charges with hydrogens summed into heavy atoms:
elementType: Cl O O C C C C C C C C C C C C C C C C C C
charge: -0.063587 -0.280683 -0.246302 0.188132 0.013615 -0.100146 -0.098424 0.044954 -0.052565 0.053353 0.047522 -0.004685 -0.116111 0.500332 0.269990 -0.139994 -0.170671 0.021703 0.027346 -0.112771 0.218995
polarizability: 3.25452724e+02 -2.18550433e+01 1.95442204e+02 -1.80363035e+01 -1.89619274e+01 1.51771829e+02
1716.lowfreq: -9.3961 0.0009 0.0010 0.0013 3.8418 5.2768 16.4915 21.5246 25.7448
frequency: 15.5450 21.3487 25.4085 41.1902 46.0022 57.2053 76.5379 96.9311 98.6566 115.2999 117.9044 163.7344 176.3070 196.9718 200.8529 220.7988 237.5525 250.4853 266.3316 281.1955 296.9183 315.7759 319.4601 329.8689 357.9123 373.1031 395.9643 410.3728 422.7164 445.3827 471.8995 520.2931 522.9844 557.0485 568.0172 626.8494 638.3119 665.4615 712.6191 756.1429 778.4455 810.6466 820.0121 826.7248 830.6661 835.5972 870.8384 876.0273 903.8645 934.0269 941.0651 950.5556 957.6584 965.0966 975.6302 977.6436 984.8038 996.7975 1002.1831 1020.5308 1073.9980 1075.8204 1091.3141 1108.0734 1113.1436 1122.2463 1141.0495 1151.2539 1169.7203 1188.9308 1193.4348 1203.2067 1223.6862 1242.6228 1256.8781 1275.4077 1291.7398 1296.5431 1302.4897 1318.0600 1329.6744 1348.3517 1353.9674 1370.7203 1373.9900 1390.9406 1401.9236 1423.6491 1440.0463 1453.8821 1457.6076 1464.5798 1466.1623 1470.4996 1470.9672 1479.0456 1480.1770 1490.5631 1574.8954 1597.7220 1645.5712 1650.1820 1667.6636 2972.8061 2974.1819 2977.8417 2985.3611 2998.6255 3005.2986 3040.2435 3054.0816 3063.9409 3069.8501 3071.4999 3072.5574 3079.8561 3080.2746 3082.5244 3086.2468 3104.0894 3108.0472 3129.5466 3141.3179 3149.3660 3166.4518 3170.1920
redmass: 4.0797 5.9140 5.4182 6.4504 4.9129 5.4864 3.7912 1.3872 2.4406 2.7245 3.2522 3.9232 3.4003 3.5261 3.1957 2.5253 3.2042 1.0327 2.6734 1.5474 2.1233 2.4776 2.7034 2.6790 2.9058 2.8771 6.4226 2.8776 3.6176 2.6928 3.3189 3.0047 2.9349 3.2275 3.2411 7.0515 3.3326 5.2684 3.3479 2.2014 3.0086 1.9528 1.7662 1.3918 2.6816 2.9267 2.2739 2.3150 2.3223 1.5518 2.2207 1.3355 2.6370 1.3835 1.6164 1.2237 1.1236 4.0812 1.4106 1.9650 2.7542 2.6659 2.1940 1.4465 1.3301 1.7854 2.2889 1.4530 1.4487 1.1418 1.5052 2.2838 2.8001 2.9208 1.2356 1.3346 1.5036 1.2624 1.4429 1.3032 1.4422 1.3931 1.4757 1.9305 1.7456 1.2856 2.9462 1.1855 1.0910 1.0511 1.0850 1.0503 1.0526 1.0959 1.0486 1.7781 1.2404 1.0654 7.1138 6.0506 8.7395 6.1516 6.5401 1.0625 1.0353 1.0355 1.0626 1.0651 1.0295 1.0966 1.0994 1.0918 1.0993 1.0989 1.0956 1.0988 1.0915 1.0969 1.0909 1.0876 1.1046 1.0896 1.0887 1.1049 1.0956 1.0962
irintensity: 0.2231 0.0146 0.0756 2.1189 0.1711 0.1135 0.5766 0.0946 0.3065 0.4201 0.2575 0.3992 5.8219 1.7065 2.0860 2.0817 1.7205 0.3507 11.9279 0.4152 3.8001 1.1590 4.9195 1.6495 2.8294 0.5748 19.9216 0.2727 3.8023 6.6420 1.6319 12.4805 2.4537 3.2821 6.5821 0.2461 2.0546 9.8039 0.5896 9.4164 14.8324 5.9314 56.7652 4.7307 4.2334 19.2196 6.6217 7.3009 10.1344 4.3437 19.0126 4.5963 8.1366 0.2342 12.4583 39.2736 56.4608 29.3163 1.7640 5.8988 33.7884 55.0674 19.0637 24.8877 7.4301 58.7504 68.0197 6.3442 5.1120 5.8945 34.2325 10.1881 8.2145 10.7130 6.7539 6.8945 0.9101 0.9808 0.4013 1.5809 14.5472 15.8677 8.1580 15.9292 12.3680 12.4123 2.4582 17.0702 23.4948 13.6717 15.5783 8.7955 7.2297 13.0784 3.5797 84.7441 23.0756 11.5086 1.4533 3.8080 153.6839 16.2227 2.0276 29.6017 34.0894 25.0202 36.5501 36.4767 24.8815 14.6443 12.5139 6.0218 26.9057 24.3394 17.8378 41.9011 32.0344 41.8016 38.0405 20.9500 23.8801 13.0689 5.1942 9.1407 7.5005 2.5647
temp: 298.150 k
press: 1.00000 atm
elementType: 17 8 8 6 6 6 6 6 6 6 6 6 6 6 6 6 6 6 6 6 6 1 1 1 1 1 1 1 1 1 1 1 1 1 1 1 1 1 1 1 1 1 1 1
symmnumber: 1
zpe: 950425.7 jmol-1
zpe.correction: 0.361998 hartree
zpe.thermalcorrener: 0.385145 hartree
zpe.thermalcorrenthalpy: 0.386089 hartree
zpe.thermalcorrgfe: 0.306366 hartree
zpe.sumelectzpe: -1308.611731 hartree
zpe.sumelectthermal: -1308.588584 hartree
zpe.sumelectthermalent: -1308.587640 hartree
zpe.sumelectthermalfe: -1308.667364 hartree
dipole: -1.6866 1.6202 0.7678
dipole: 2.4615
quadrupole: -144.1981 -131.0312 -132.0119
quadrupole: -0.9357 -13.0091 -7.9595
quadrupole: -8.4510 4.7159 3.7352 -0.9357 -13.0091 -7.9595
hfenergy: -1308.9737292 hartree
pointgroup: C01 [X(C18H23Cl1O2)]
dipole: -0.5007937 0.7701573 0.3064538 debye
polarizability: 309.0217416|-48.3589257|212.3154876|-21.6125339|-14.0094012|151.329527 unknown
InChI: InChI=1S/C18H23ClO2/c1-18(2,13-6-4-5-7-17(20)21-3)14-12-15-8-10-16(19)11-9-15/h6,8-14H,4-5,7H2,1-3H3
charge 0 multiplicity 1
44 atoms
Cl 5.752461 -2.595666 0.429598
O  -1.223796 -2.228861 -0.017722
O  -3.183295 -2.411837 -1.262698
C  -0.992555 2.668703 0.053131
C  -2.161811 1.787161 -0.410104
C  -0.666381 3.697341 -1.060452
C  -1.301105 3.417816 1.377193
C  0.148855 1.677561 0.302593
C  -4.355569 0.523434 -0.231083
C  -3.303491 1.493739 0.266406
C  -4.552972 -0.695262 0.718428
C  -3.249527 -1.465199 1.028904
C  1.318445 1.568211 -0.390014
C  2.363223 0.545895 -0.170584
C  -2.603226 -2.070319 -0.206615
C  2.149574 -0.626212 0.613226
C  3.639349 0.713505 -0.779317
C  3.173391 -1.576332 0.80198
C  4.675451 -0.228733 -0.603306
C  4.426818 -1.362622 0.192221
C  -0.487165 -2.847002 -1.150119
H  -1.99804 1.312478 -1.391582
H  -1.519773 4.384707 -1.198003
H  0.223261 4.299852 -0.797993
H  -0.476165 3.200324 -2.029593
H  -2.193001 4.061371 1.263641
H  -0.444763 4.05528 1.660282
H  -1.486842 2.715205 2.210478
H  -0.062233 0.970228 1.119517
H  -5.333638 1.037522 -0.3283
H  -4.08388 0.156566 -1.238185
H  -3.490397 1.948622 1.251515
H  -4.983757 -0.351246 1.679537
H  -5.285505 -1.384123 0.25833
H  -3.466057 -2.297971 1.728328
H  -2.508136 -0.817406 1.527347
H  1.535016 2.296749 -1.183289
H  1.168261 -0.814868 1.061636
H  3.827577 1.601109 -1.395335
H  2.999808 -2.471513 1.406699
H  5.652142 -0.083537 -1.073846
H  -0.807935 -3.894003 -1.283377
H  -0.679175 -2.287083 -2.080246
H  0.571963 -2.786786 -0.864228
